program: Gaussian 09
title: 000154567
version: EM64L-G09RevD.01
frameworkgroup: C1[X(C20H19N3O3)]
method: RPBEPBE
basis: SDD
operation: Freq
keyword: #p
keyword: freq=noraman
keyword: PBEPBE/SDD
title: #p freq=noraman PBEPBE/SDD
converged: YES YES NO NO
title: Mulliken charges:
elementType: O O O N N N C C C C C C C C C C C C C C C C C C C C H H H H H H H H H H H H H H H H H H H
charge: -0.319365 -0.270263 -0.250874 -0.459911 -0.051538 -0.446567 0.143920 0.254081 -0.013240 0.086493 -0.399437 -0.358283 -0.250918 -0.203898 0.200618 0.458618 -0.390459 -0.377671 -0.371920 0.479075 -0.358693 -0.439767 -0.212443 -0.676982 0.221167 -0.781809 0.341016 0.260643 0.235883 0.224773 0.223604 0.298088 0.239396 0.270820 0.309284 0.216680 0.230699 0.230718 0.303205 0.216851 0.228111 0.227950 0.259840 0.259525 0.212978
chargesum: 0.00000
title: Mulliken charges with hydrogens summed into heavy atoms:
elementType: O O O N N N C C C C C C C C C C C C C C C C C C C C
charge: -0.319365 -0.270263 -0.250874 -0.118895 -0.051538 -0.143362 0.143920 0.254081 -0.013240 0.086493 -0.138794 -0.122400 -0.026145 0.019706 0.200618 0.458618 -0.092371 -0.138276 -0.101100 0.479075 -0.049408 -0.223086 0.248974 -0.004070 0.221167 -0.049466
polarizability: 5.69808063e+02 -3.04507954e+01 3.30375351e+02 -2.64097157e-02 -7.47740330e-01 1.09734177e+02
1716.lowfreq: -4.7343 -2.5141 -0.0009 -0.0004 0.0005 3.8954 8.0808 23.2745 31.5471
frequency: 7.5763 23.2614 31.5116 33.5373 49.3197 67.0135 70.4962 71.7022 81.1661 96.5018 119.7886 122.1547 138.1349 145.0843 202.9624 216.9736 224.8121 237.3769 246.6868 280.7791 302.8317 325.4131 339.5321 350.0771 363.4516 403.1680 412.9897 424.3857 426.6425 436.6444 505.9617 530.9042 566.7141 579.2967 593.6050 595.9318 615.4562 615.9293 633.3390 649.2787 654.2759 656.1900 735.2331 735.7352 745.6588 758.6491 767.4467 781.8588 799.5304 813.9686 815.7605 839.3570 857.7746 861.5954 865.7539 865.9271 916.4909 931.4495 949.3685 979.1306 983.8379 991.8663 994.8067 1003.9179 1004.8847 1020.6617 1026.0207 1039.5624 1048.4916 1110.6125 1112.7524 1115.4808 1137.2923 1161.8558 1171.7367 1177.6702 1216.3753 1226.2320 1234.5357 1249.9962 1250.7196 1264.0533 1301.3064 1304.9737 1325.1178 1353.1075 1359.8140 1373.3835 1388.4390 1400.6916 1418.8124 1423.7725 1440.5334 1446.2070 1448.7831 1465.2373 1469.8584 1474.5892 1477.3424 1486.1284 1488.7085 1489.1164 1512.1987 1548.2991 1582.5806 1586.9824 1617.4992 1623.3482 1628.0282 1631.6000 2994.6589 2995.3442 3010.6794 3030.2951 3068.3855 3091.6821 3096.6949 3099.0248 3104.9882 3105.8652 3128.4481 3131.0730 3142.4295 3156.9551 3163.3557 3171.8662 3198.1457 3530.8811 3589.3481
redmass: 3.7273 4.2330 2.9913 5.4805 1.2819 2.8950 5.3268 3.0752 4.0722 6.8174 5.4960 3.5808 3.6615 6.8113 4.8723 4.4360 3.8966 5.4787 1.2662 4.5759 5.4920 5.3085 6.5181 4.0388 4.7584 4.4009 3.4420 4.4012 5.3021 3.3173 4.5114 2.5364 4.1960 5.7134 6.6018 3.1624 1.1526 5.8464 6.8696 4.8790 1.1911 5.7832 4.8891 7.8192 3.4096 1.6799 6.8012 3.3312 1.1031 5.0087 3.9766 1.3880 5.1249 1.4824 4.7092 1.4779 5.6384 6.2116 1.3762 1.3410 1.3134 1.6633 1.3495 2.3156 2.1768 1.5478 2.5241 1.6309 7.0050 1.8917 1.8224 1.4289 1.4656 1.1306 2.9737 1.2480 3.2953 1.5792 2.1610 1.1313 2.0247 2.1407 2.6360 2.0461 1.8655 2.3572 1.5350 2.9201 1.2186 1.2723 3.7735 4.5127 4.6069 2.5360 1.0454 1.0404 1.1091 1.1382 2.7606 2.1977 2.8548 1.2615 3.4514 5.3917 5.7473 6.5888 6.8838 5.8097 6.0123 7.9047 1.0357 1.0362 1.0581 1.0909 1.1064 1.0985 1.0999 1.0986 1.1029 1.0899 1.0855 1.0908 1.0901 1.0959 1.0941 1.0986 1.0944 1.0763 1.0803
irintensity: 3.5877 0.1824 0.3078 1.2284 0.8737 0.0037 8.9103 4.0897 0.0797 0.0008 5.8827 2.9987 0.2425 0.0148 1.3918 0.5236 10.5867 4.1558 0.0635 2.0887 7.4662 6.7516 6.0293 2.2887 16.8115 7.9057 0.6125 0.1395 0.9039 12.8633 0.5933 33.9103 0.0083 21.7319 3.1140 0.7635 75.2475 6.3809 3.4060 13.1986 51.6884 19.3242 37.2777 3.0927 1.7052 73.2597 5.9496 12.0421 4.7853 1.5566 31.1088 28.6142 5.8494 4.9269 0.3107 44.4529 65.0887 7.7582 2.2797 3.0982 0.1172 29.8482 9.6149 13.9066 2.5029 18.6926 20.0282 15.3205 673.5480 29.4218 13.5009 0.5830 5.2592 28.2277 56.6863 85.9669 122.2042 173.6073 279.0276 0.0019 26.9729 57.0262 195.1431 37.2010 18.3464 275.4529 34.1623 13.2066 78.9998 27.5024 4.3517 19.3583 65.5217 73.2587 15.3958 12.5034 33.9788 41.2128 114.1700 291.7900 118.0562 103.0420 368.7480 51.1898 59.4901 0.0145 326.3870 14.9166 103.6184 121.1345 27.2731 15.9303 18.9891 1.0124 5.9810 29.5997 16.4536 10.1045 46.6441 32.1671 0.9553 6.3742 12.3571 32.6413 5.2656 26.2875 2.9154 13.5102 174.7041
temp: 298.150 k
press: 1.00000 atm
elementType: 8 8 8 7 7 7 6 6 6 6 6 6 6 6 6 6 6 6 6 6 6 6 6 6 6 6 1 1 1 1 1 1 1 1 1 1 1 1 1 1 1 1 1 1 1
symmnumber: 1
zpe: 920463.5 jmol-1
zpe.correction: 0.350586 hartree
zpe.thermalcorrener: 0.374759 hartree
zpe.thermalcorrenthalpy: 0.375703 hartree
zpe.thermalcorrgfe: 0.292473 hartree
zpe.sumelectzpe: -1161.651966 hartree
zpe.sumelectthermal: -1161.627793 hartree
zpe.sumelectthermalent: -1161.626849 hartree
zpe.sumelectthermalfe: -1161.710079 hartree
dipole: 1.9435 -2.0817 0.0667
dipole: 2.8486
quadrupole: -103.7873 -135.8699 -157.3955
quadrupole: 35.7283 -0.3356 -0.0739
quadrupole: 28.5636 -3.5189 -25.0446 35.7283 -0.3356 -0.0739
hfenergy: -1162.0025523 hartree
pointgroup: C01 [X(C20H19N3O3)]
dipole: -0.7952283 -0.76626 -0.1911169 debye
polarizability: 571.6937949|22.069451|317.4656352|-0.7877539|47.6979643|120.7581609 unknown
InChI: InChI=1S/C20H19N3O3/c1-3-26-20(25)19-18(16-6-4-5-7-17(16)23-19)21-12-14-8-10-15(11-9-14)22-13(2)24/h4-12,22-23H,3H2,1-2H3
charge 0 multiplicity 1
45 atoms
O  -3.839713 2.687828 0.627399
O  -1.500294 2.706552 0.626207
O  7.055814 1.532274 0.250828
N  -4.060186 0.145243 0.063416
N  -0.440768 -0.541884 -0.134853
N  6.071728 -0.54572 -0.235631
C  -2.651197 -1.591927 -0.345901
C  -4.031182 -1.209083 -0.244188
C  -1.828514 -0.420102 -0.087855
C  -2.750418 0.652549 0.165968
C  -2.314009 -2.933517 -0.656506
C  -5.084079 -2.133018 -0.444373
C  -3.354508 -3.857349 -0.856957
C  -4.724604 -3.458681 -0.751354
C  -2.577293 2.065442 0.483935
C  1.868737 0.171481 0.003504
C  0.428306 0.428342 0.087537
C  2.787018 1.230685 0.247497
C  2.391247 -1.115311 -0.318545
C  4.683633 -0.252022 -0.143588
C  4.179081 1.03754 0.178754
C  3.773888 -1.323326 -0.391037
C  -3.809997 4.14257 0.95693
C  -5.26012 4.602672 1.06657
C  7.165303 0.307053 -0.046314
C  8.528485 -0.358362 -0.228047
H  -4.877507 0.73823 0.204005
H  -1.261127 -3.220227 -0.733559
H  -6.135059 -1.835135 -0.36585
H  -3.120858 -4.899972 -1.098273
H  -5.511647 -4.203787 -0.913877
H  0.118793 1.457226 0.340872
H  2.397385 2.225677 0.495688
H  1.681703 -1.927072 -0.505705
H  4.878469 1.853398 0.366611
H  4.164306 -2.31931 -0.640272
H  -3.251675 4.273293 1.90144
H  -3.258377 4.668408 0.156811
H  6.294892 -1.515056 -0.472886
H  -5.290848 5.680662 1.308313
H  -5.798045 4.447195 0.1155
H  -5.790665 4.055218 1.864628
H  9.113247 -0.232526 0.699285
H  9.076569 0.163304 -1.031647
H  8.477686 -1.433558 -0.47338
