program: Gaussian 09
title: 000154542
version: EM64L-G09RevD.01
frameworkgroup: C1[X(C9H7NO2)]
method: RPBEPBE
basis: SDD
operation: Freq
keyword: #pfreq=noraman
keyword: PBEPBE/SDD
title: #p freq=noraman PBEPBE/SDD
converged: NO YES NO NO
title: Mulliken charges:
elementType: O O N C C C C C C C C C H H H H H H H
charge: -0.285666 -0.288363 -0.029304 -0.116512 -0.110604 -0.281460 -0.190008 0.417090 0.003298 -0.312242 -0.172492 -0.350047 0.242117 0.244313 0.235756 0.259015 0.251083 0.236017 0.248008
chargesum: 0.00000
title: Mulliken charges with hydrogens summed into heavy atoms:
elementType: O O N C C C C C C C C C
charge: -0.285666 -0.288363 -0.029304 0.125606 0.133709 -0.045704 0.069007 0.417090 0.003298 -0.061159 0.063525 -0.102038
polarizability: 1.40427347e+02 -7.62754193e-01 9.99324790e+01 -2.32198780e-01 6.99918077e+00 5.86417934e+01
1716.lowfreq: -18.4327 -8.6270 -0.0007 0.0002 0.0008 10.6489 105.6541 118.0515 219.4115
frequency: 105.6533 118.0467 219.4107 270.6314 332.8266 355.5348 390.9822 458.2033 480.8508 550.9219 565.1243 603.1281 669.9636 671.9854 718.2122 771.7280 783.5862 807.7425 818.7294 828.6222 890.2111 920.7738 943.5857 987.3996 1008.1861 1033.7696 1042.5446 1051.4418 1098.8996 1109.7016 1162.7077 1215.8082 1230.6027 1238.7809 1247.4552 1316.3185 1338.3425 1365.3624 1401.1856 1411.2472 1445.9659 1458.8583 1563.1468 1587.3361 3103.8168 3111.8427 3121.9513 3133.7752 3140.5894 3149.2766 3171.8585
redmass: 5.4276 5.3545 6.2549 5.4241 4.7409 4.9063 9.8233 5.0853 5.6675 3.9861 5.0398 6.7137 7.3749 7.6165 4.8911 3.9649 4.3902 1.9576 5.0622 2.6888 6.1271 2.7199 1.4509 1.3938 1.5820 1.2235 2.4630 1.2370 1.4209 1.6424 1.8313 1.6816 1.5213 1.5504 1.2666 6.2225 1.4206 1.7268 1.9894 5.2248 3.7856 3.0341 6.3722 6.4599 1.0869 1.0890 1.0944 1.0884 1.0921 1.0928 1.0996
irintensity: 3.9767 1.0234 16.3643 12.8727 3.3477 1.1282 0.4486 0.7870 0.4733 3.7007 11.7833 12.1884 11.4604 10.7964 11.2283 33.4079 7.4285 64.5824 21.5189 6.5187 5.8532 2.2586 0.0690 0.3093 14.2297 0.8495 2.1792 1.3377 2.0110 2.1189 10.4980 1.3264 0.6434 3.7627 1.5270 2.5012 4.7257 0.0501 5.1395 14.1779 19.8603 8.1602 12.5371 6.4063 2.2831 27.1476 41.1057 2.7997 18.3308 14.5040 23.9401
temp: 298.150 k
press: 1.00000 atm
elementType: 8 8 7 6 6 6 6 6 6 6 6 6 1 1 1 1 1 1 1
symmnumber: 1
zpe: 367999.0 jmol-1
zpe.correction: 0.140163 hartree
zpe.thermalcorrener: 0.148742 hartree
zpe.thermalcorrenthalpy: 0.149686 hartree
zpe.thermalcorrgfe: 0.106472 hartree
zpe.sumelectzpe: -551.416822 hartree
zpe.sumelectthermal: -551.408243 hartree
zpe.sumelectthermalent: -551.407299 hartree
zpe.sumelectthermalfe: -551.450513 hartree
dipole: -1.1030 2.2962 0.6044
dipole: 2.6180
quadrupole: -56.1449 -71.0147 -73.4962
quadrupole: -4.1260 -1.0042 9.2365
quadrupole: 10.7404 -4.1294 -6.6109 -4.1260 -1.0042 9.2365
hfenergy: -551.556985 hartree
pointgroup: C01 [X(C9H7N1O2)]
dipole: 0.427913 -0.8993622 0.2626373 debye
dipolederiv: -0.459634 -0.1151892 -0.009782 -0.2311036 -0.4987569 -0.1022183 -0.1693231 -0.1912851 -0.5089286 -0.4233511 0.1268768 0.0129648 0.223124 -0.500165 -0.0858642 0.1480672 -0.1854661 -0.5079947 -0.4441681 0.0049373 0.0140338 -0.0019758 -0.2820089 0.0233349 0.0204404 0.0092625 -0.23224 0.2428272 0.0906107 -0.084378 0.1198418 0.2561354 -0.0108484 -0.1568036 0.0817902 0.2302629 0.2257591 -0.1056794 0.0807226 -0.1312599 0.2361122 -0.023386 0.1515084 0.0631972 0.2216164 0.3120437 0.1107085 -0.0296668 0.2109359 0.3152514 -0.0424886 0.0471816 -0.0582097 0.2749932 0.2008816 -0.0842507 0.0314193 -0.1512453 0.3126223 -0.0346932 -0.0320326 -0.0352945 0.2591167 -0.0685993 0.0215872 0.0169712 0.2563249 -0.180295 0.0799218 0.019175 0.139347 -0.0208316 0.3001512 -0.0091708 -0.0342675 -0.2758814 0.1419589 -0.0004491 -0.0135085 0.0340881 -0.0071785 0.062479 -0.0060187 -0.013924 -0.0444759 0.1598715 -0.0813843 -0.0127917 -0.0885674 -0.0925635 -0.046168 -0.0611301 0.0356415 -0.2359071 -0.1562353 0.012217 0.0693396 0.0191207 -0.1116681 0.2582582 0.0369991 -0.0262621 0.2545919 0.1611581 -0.0875076 -0.0733593 -0.0752312 -0.0438619 -0.0793584 -0.0446708 0.0996381 -0.0396814 0.0150107 0.0222701 0.0946445 0.0116208 0.0431655 -0.0763971 0.0504722 -0.1007473 0.0396678 0.0162136 0.0254517 -0.092582 0.0123071 0.0446606 0.0098833 0.0208807 -0.0382759 -0.0419074 -0.0469127 0.1073005 -0.0210961 0.0856797 0.0094822 0.0420944 -0.0178458 0.0352019 0.0426358 -0.0091149 0.0832731 0.0170912 0.0606407 0.0346682 0.0991461 -0.0263575 0.0092461 0.0093678 -0.0656095 0.0610183 0.0011355 0.0591898 0.1242207 -0.0714603 0.0689509 -0.0212992 0.0869677 0.0682005 0.027282 -0.0240909 0.0312493 0.1535497 -0.0843876 -0.0617103 0.0227635 -0.0900198 0.0565637 0.0267705 0.0270044 0.0265608 0.1295307 unknown
polarizability: 140.4147821|-1.0628848|99.5150687|0.0658808|-8.1592474|59.0717685 unknown
InChI: InChI=1S/C9H7NO2/c1-2-4-5(10-3-1)7-9(12-7)8-6(4)11-8/h1-3,6-9H
charge 0 multiplicity 1
19 atoms
O  -1.726903 -1.665636 -0.905872
O  -1.684997 1.656865 0.907913
N  1.568198 1.349681 -0.412718
C  -2.205708 -0.713587 0.17596
C  -2.179276 0.741876 -0.197097
C  -0.907915 -1.429113 0.375005
C  -0.857395 1.420591 -0.365777
C  0.388479 -0.714507 0.201257
C  0.413238 0.656886 -0.186733
C  1.62364 -1.372178 0.392248
C  2.825874 -0.662055 0.178307
C  2.749655 0.688413 -0.231978
H  -3.095361 -1.06263 0.714874
H  -3.05094 1.124846 -0.741817
H  -0.892945 -2.309994 1.02892
H  -0.774323 2.310876 -0.997204
H  1.645424 -2.425593 0.694303
H  3.799711 -1.1409 0.317252
H  3.657244 1.271359 -0.423544
