program: Gaussian 09
title: 000154541
version: EM64L-G09RevD.01
frameworkgroup: C1[X(C9H7NO2)]
method: RPBEPBE
basis: SDD
operation: Freq
keyword: #pfreq=noraman
keyword: PBEPBE/SDD
title: #p freq=noraman PBEPBE/SDD
converged: NO NO NO NO
title: Mulliken charges:
elementType: O O N C C C C C C C C C H H H H H H H
charge: -0.226038 -0.271628 -0.005335 -0.170158 -0.122955 -0.262281 -0.152447 0.316610 -0.050502 -0.339534 -0.154042 -0.355571 0.267893 0.259176 0.250142 0.263890 0.267861 0.235813 0.249107
chargesum: 0.00000
title: Mulliken charges with hydrogens summed into heavy atoms:
elementType: O O N C C C C C C C C C
charge: -0.226038 -0.271628 -0.005335 0.097734 0.136221 -0.012138 0.111443 0.316610 -0.050502 -0.071673 0.081771 -0.106464
polarizability: 1.36910766e+02 5.03469794e-02 1.05281091e+02 3.24768758e+00 -9.07478163e-01 5.90597929e+01
1716.lowfreq: -8.5643 -1.8436 -0.0007 0.0004 0.0005 8.9063 111.4690 132.1527 226.8869
frequency: 111.4657 132.1492 226.8851 282.6549 315.1615 356.0044 395.0021 423.5898 467.7514 483.7431 532.3156 605.3567 622.4384 695.1508 730.6238 750.2538 786.9976 823.1404 827.3004 842.4946 863.1606 939.5315 947.1622 990.2960 1010.6387 1021.2222 1036.5170 1063.0310 1078.6319 1103.3185 1148.8747 1169.7977 1225.3480 1229.1067 1246.1057 1271.4823 1319.8423 1328.5008 1336.5698 1372.5219 1390.0736 1435.1180 1534.9083 1594.0408 3056.2606 3102.7765 3131.6756 3138.4867 3144.7392 3153.8214 3173.9920
redmass: 5.4884 4.8884 6.5103 4.2637 6.3024 4.9000 5.4436 6.9746 5.7080 3.7792 4.0634 5.3360 6.5794 6.1885 3.8069 5.3324 2.7805 2.1965 4.3925 4.5506 6.5162 1.6700 1.7433 1.3949 1.9503 1.3137 2.6115 1.4875 2.2874 1.3759 1.9317 1.6900 2.1587 1.7478 1.9147 2.1320 1.9768 2.2215 1.1755 2.2546 2.8074 2.0621 5.6782 6.8577 1.0860 1.0871 1.0888 1.0881 1.0950 1.0922 1.1001
irintensity: 7.0405 3.6029 1.2443 8.8005 12.8050 5.4591 0.6564 3.3215 2.5532 0.5498 8.4516 1.0536 8.4857 12.1228 19.5509 31.4696 56.4522 24.2119 14.2697 18.7157 4.5598 1.3741 4.1734 0.8391 9.0184 24.4017 1.0705 4.2321 10.6406 0.5224 5.2661 1.6287 1.8848 0.0809 5.0783 1.2966 4.9243 4.1141 7.2219 31.8621 11.9945 1.2082 14.9666 0.0858 8.7025 5.4356 6.0574 5.9959 21.7306 11.9715 21.1085
temp: 298.150 k
press: 1.00000 atm
elementType: 8 8 7 6 6 6 6 6 6 6 6 6 1 1 1 1 1 1 1
symmnumber: 1
zpe: 364669.8 jmol-1
zpe.correction: 0.138895 hartree
zpe.thermalcorrener: 0.147559 hartree
zpe.thermalcorrenthalpy: 0.148503 hartree
zpe.thermalcorrgfe: 0.105221 hartree
zpe.sumelectzpe: -551.342561 hartree
zpe.sumelectthermal: -551.333898 hartree
zpe.sumelectthermalent: -551.332954 hartree
zpe.sumelectthermalfe: -551.376236 hartree
dipole: -2.2666 1.2753 2.0081
dipole: 3.2858
quadrupole: -61.6507 -77.3641 -68.3874
quadrupole: -7.6149 5.5390 -3.1501
quadrupole: 7.4833 -8.2300 0.7467 -7.6149 5.5390 -3.1501
hfenergy: -551.4814568 hartree
pointgroup: C01 [X(C9H7N1O2)]
dipole: 0.892324 -0.5280539 0.7720429 debye
dipolederiv: -0.5081765 -0.263665 0.0436114 -0.318236 -0.6175217 -0.0889153 -0.0348447 -0.1081972 -0.276923 -0.4229921 0.1058603 0.0000628 0.19338 -0.5542338 0.0846646 -0.132602 0.1632391 -0.45255 -0.357255 -0.0166401 0.0005504 -0.0719168 -0.3044996 -0.0212726 0.0503842 -0.0181743 -0.2213282 -0.0327921 0.1259071 -0.0873193 0.0349627 0.3300269 0.0294335 -0.0251513 0.0547849 0.1952919 0.2746276 -0.1568073 -0.0178171 -0.0139954 0.3773489 0.0189834 -0.0494427 0.0132774 0.1867027 0.319027 0.2898849 -0.0535017 0.3455228 0.1237197 0.1151416 0.015743 0.0546808 0.2391387 0.2644847 -0.1125429 -0.0259037 -0.1155467 0.2279726 0.0664138 0.066898 0.0319804 0.2186247 0.1373069 0.0368708 0.0097118 0.1492899 -0.153205 -0.0920429 -0.0634753 -0.0718502 -0.02774 0.1281032 0.0084431 -0.0239516 -0.2657883 0.1774257 0.0270804 -0.0391595 -0.0397376 -0.0325466 0.0152548 -0.0196931 -0.0192272 -0.0092623 0.1714435 0.0163112 0.0301349 0.040805 -0.0965283 -0.0341415 -0.039414 -0.0308772 -0.233847 -0.1274071 0.0373946 -0.0236237 0.017679 -0.0869825 0.2257084 0.0754948 -0.0420984 0.314024 0.1547825 -0.0166423 -0.0437242 0.0166808 -0.0725625 0.1083807 0.0131794 0.0815681 0.007787 -0.0044582 0.0356021 0.0877326 0.0021389 -0.009327 -0.0445291 0.0295027 0.0942524 0.0271389 0.0267778 -0.0282301 0.1002287 -0.0360517 0.049683 -0.0380681 -0.062453 0.0334639 -0.0923717 0.1059986 -0.0578013 0.0106567 -0.0251038 -0.0745441 0.0162786 0.0008555 -0.0354154 0.0396991 -0.0004052 -0.0976065 -0.0247728 -0.0542567 0.0311714 0.0983583 -0.0109232 0.0075388 0.0200044 -0.0482746 -0.0122825 0.0028433 -0.0116637 0.1452767 -0.069224 0.0644925 0.0396333 0.0821682 0.0657096 -0.0220412 0.0495669 -0.0252553 0.1490377 -0.0803519 -0.0683527 0.0257189 -0.0930128 0.0487995 0.0058097 0.0226078 -0.0049755 0.1361054 unknown
polarizability: 136.8309616|-0.3367192|105.2403822|-4.0371106|1.7450191|59.1803065 unknown
InChI: InChI=1S/C9H7NO2/c1-2-4-5(10-3-1)7-9(12-7)8-6(4)11-8/h1-3,6-9H
charge 0 multiplicity 1
19 atoms
O  -2.13461 -2.073586 -0.180335
O  -1.728185 1.837798 -0.683522
N  1.55964 1.337747 0.124822
C  -1.92898 -0.581651 -0.400429
C  -2.22736 0.769767 0.250072
C  -0.965038 -1.322774 0.456503
C  -0.861142 1.39352 0.512037
C  0.420968 -0.845232 0.126257
C  0.417706 0.603535 0.226013
C  1.634942 -1.506888 -0.117547
C  2.811492 -0.73016 -0.265333
C  2.728447 0.672025 -0.126684
H  -1.620415 -0.423378 -1.442874
H  -3.113043 1.008751 0.847604
H  -1.166761 -1.275157 1.53812
H  -0.738234 2.204434 1.237843
H  1.66392 -2.597782 -0.197069
H  3.776468 -1.20275 -0.472636
H  3.621584 1.299779 -0.217444
