program: Gaussian 09
title: 000154502
version: EM64L-G09RevD.01
frameworkgroup: C1[X(C6H13N3O5)]
method: RPBEPBE
basis: SDD
operation: Freq
keyword: #p
keyword: freq=noraman
keyword: PBEPBE/SDD
title: #p freq=noraman PBEPBE/SDD
converged: YES YES NO NO
title: Mulliken charges:
elementType: O O O O O N N N C C C C C C H H H H H H H H H H H H H
charge: -0.459752 -0.455699 -0.496323 -0.496248 -0.420294 -0.095589 -0.022911 -0.046079 -0.145996 -0.098025 -0.081139 -0.151942 -0.427324 -0.367632 0.237452 0.270949 0.272424 0.246759 0.266925 0.236804 0.247947 0.181655 0.364966 0.363353 0.381740 0.357595 0.336386
chargesum: 0.00000
title: Mulliken charges with hydrogens summed into heavy atoms:
elementType: O O O O O N N N C C C C C C
charge: -0.094786 -0.092346 -0.114583 -0.138653 -0.083909 -0.095589 -0.022911 -0.046079 0.091456 0.172924 0.191285 0.094817 0.076405 0.061969
polarizability: 1.55728293e+02 4.03412308e+00 8.96823497e+01 2.13231721e+00 -5.83343578e-01 7.88962782e+01
1716.lowfreq: -0.0007 -0.0007 0.0004 2.7087 6.1745 14.0951 28.9938 40.8171 57.7254
frequency: 28.5871 40.7565 57.5412 80.7318 88.5033 109.3132 119.7082 154.5258 183.2973 200.5977 219.1320 239.0475 267.2538 287.4960 297.7613 318.5019 362.9111 423.2125 437.5647 446.2116 482.4127 514.1807 525.3691 537.2966 586.7028 592.1376 638.8932 695.1278 828.6758 833.0223 878.7773 915.5796 948.5809 966.2541 979.0284 1025.6036 1029.1102 1041.1209 1063.1930 1086.2380 1091.9023 1139.0683 1156.4833 1173.8288 1204.9005 1239.1600 1268.3629 1272.4148 1275.1786 1293.7472 1303.6534 1345.6061 1347.1462 1351.4536 1364.4298 1376.1808 1377.6936 1392.5736 1404.2293 1452.1519 1466.9694 2051.9499 2934.5442 2974.3462 2987.8233 3025.5818 3036.6848 3051.6579 3064.4999 3094.0097 3431.3339 3471.3141 3525.5928 3551.6712 3599.9406
redmass: 8.7008 7.6142 5.4378 6.5299 4.8932 4.6071 3.9049 3.4779 4.8139 1.8947 1.8357 5.9602 4.7684 3.6807 5.1514 1.4192 3.2023 3.1443 3.9282 1.4232 12.5716 2.5640 2.4242 1.3921 1.1911 5.4391 3.4757 3.6074 3.3280 3.1918 7.2544 2.8708 2.4267 3.8256 4.2900 2.2991 3.2756 2.1989 2.1467 3.2944 1.9964 1.1760 1.1630 1.4666 1.1878 1.2500 8.8201 1.3013 1.2404 1.2202 1.2894 1.2611 1.2355 1.3082 1.3037 1.5217 1.2982 1.2680 1.4963 1.0830 1.0811 13.3477 1.0706 1.0559 1.0846 1.0892 1.0861 1.1023 1.0871 1.0937 1.0642 1.0646 1.0655 1.0662 1.0667
irintensity: 0.1145 0.8752 0.6481 2.7480 2.7338 8.6820 4.1105 27.5230 4.2977 74.9141 43.7748 38.4486 7.9565 30.3463 5.3746 116.2141 134.3298 32.5462 11.8866 113.1614 1.7398 59.3710 30.4608 74.6754 242.2863 13.0235 52.9322 11.5245 14.5048 14.0015 6.6570 39.0411 24.4394 95.9539 61.1434 12.5349 53.6480 82.5543 32.3148 0.4579 3.7458 33.1836 59.6355 1.2210 13.1044 74.9836 106.1690 4.2255 45.9194 1.8367 52.8547 16.4110 8.7093 2.4629 2.0261 36.0147 23.0873 75.2572 18.4972 21.6100 6.3426 398.3502 95.2338 18.9068 20.9799 2.3797 10.4331 29.3087 15.4206 12.1453 49.3135 34.9264 41.4760 6.6718 9.9117
temp: 298.150 k
press: 1.00000 atm
elementType: 8 8 8 8 8 7 7 7 6 6 6 6 6 6 1 1 1 1 1 1 1 1 1 1 1 1 1
symmnumber: 1
zpe: 548057.4 jmol-1
zpe.correction: 0.208744 hartree
zpe.thermalcorrener: 0.225012 hartree
zpe.thermalcorrenthalpy: 0.225957 hartree
zpe.thermalcorrgfe: 0.164016 hartree
zpe.sumelectzpe: -775.575460 hartree
zpe.sumelectthermal: -775.559191 hartree
zpe.sumelectthermalent: -775.558247 hartree
zpe.sumelectthermalfe: -775.620188 hartree
dipole: 2.1378 -1.7720 2.8667
dipole: 3.9910
quadrupole: -86.2686 -79.3596 -88.9024
quadrupole: -7.3013 10.5710 1.3204
quadrupole: -1.4251 5.4839 -4.0588 -7.3013 10.5710 1.3204
hfenergy: -775.7842037 hartree
pointgroup: C01 [X(C6H13N3O5)]
dipole: -0.7920045 1.2998511 0.3854597 debye
polarizability: 155.7400409|-1.0512616|85.5195056|-4.5437432|-5.1115609|83.0473741 unknown
InChI: InChI=1S/C6H13N3O5/c7-9-8-1-3(11)5(13)6(14)4(12)2-10/h3-6,10-14H,1-2H2
charge 0 multiplicity 1
27 atoms
O  -0.402587 0.54766 1.708373
O  -1.578991 -0.181957 -1.800795
O  0.888812 -1.515513 0.70862
O  -2.886607 1.844001 -0.746144
O  -4.260728 -1.305063 0.844016
N  3.306045 -0.56047 -0.092889
N  4.50578 -0.165535 -0.142669
N  5.675509 0.029719 -0.205644
C  -0.344967 0.480442 0.240685
C  -1.642986 -0.148245 -0.332587
C  0.894207 -0.337177 -0.180583
C  -2.888573 0.635973 0.118341
C  2.197955 0.453432 0.018451
C  -4.194226 -0.162737 -0.075603
H  -0.265422 1.525366 -0.111636
H  -1.724662 -1.197452 0.000963
H  0.789404 -0.653954 -1.235035
H  -2.759942 0.924303 1.182663
H  2.210351 0.920971 1.022814
H  2.2954 1.239863 -0.755197
H  -4.224553 -0.602293 -1.085513
H  -5.07446 0.50691 0.054869
H  -0.084205 -0.348485 2.016163
H  -1.901103 0.711308 -2.104789
H  1.775229 -1.956516 0.629557
H  -3.651461 2.428641 -0.524223
H  -4.246219 -0.973091 1.777992
