program: Gaussian 09
title: 000154496
version: EM64L-G09RevD.01
frameworkgroup: C1[X(C12H4Br6)]
method: RPBEPBE
basis: SDD
operation: Freq
keyword: #pfreq=noraman
keyword: PBEPBE/SDD
title: #p freq=noraman PBEPBE/SDD
converged: NO YES NO NO
title: Mulliken charges:
elementType: Br Br Br Br Br Br C C C C C C C C C C C C H H H H
charge: 0.075884 0.075880 0.112032 0.068502 0.075974 0.050618 0.393561 0.417210 -0.315757 -0.315766 -0.294676 -0.345581 -0.153772 -0.153776 -0.174649 -0.187414 -0.220186 -0.193528 0.279516 0.279517 0.262275 0.264137
chargesum: 0.00000
title: Mulliken charges with hydrogens summed into heavy atoms:
elementType: Br Br Br Br Br Br C C C C C C C C C C C C
charge: 0.075884 0.075880 0.112032 0.068502 0.075974 0.050618 0.393561 0.417210 -0.315757 -0.315766 -0.294676 -0.345581 0.125745 0.125740 -0.174649 0.074861 -0.220186 0.070609
polarizability: 3.06559962e+02 4.85154697e+00 2.02280410e+02 2.72558975e-03 6.87592997e-04 1.84985925e+02
1716.lowfreq: -3.3727 -0.0002 0.0002 0.0002 3.0365 4.5787 21.9374 22.6922 31.8407
frequency: 21.8944 22.6888 31.8291 58.4866 59.9492 80.8381 86.4915 112.3912 127.0565 130.6417 131.1476 174.0998 179.2790 204.8697 220.7342 253.6670 282.7661 298.9902 334.5413 348.5415 401.1755 430.4548 460.4792 490.9234 507.9427 529.2383 575.7022 590.4244 679.6611 708.6189 721.5400 730.2384 740.0615 783.2371 812.8431 866.8882 877.4345 954.2298 972.4581 1036.7576 1081.3442 1097.9508 1134.0573 1157.5718 1180.7421 1245.0958 1326.7570 1328.5212 1349.6695 1354.6022 1395.7335 1444.9409 1530.4723 1536.1706 1559.8545 1572.6403 3166.6279 3185.5039 3187.0050 3189.1682
redmass: 55.2158 50.4651 33.5910 36.0101 56.5038 7.4526 64.1241 41.6994 18.7594 37.1383 15.2779 40.9065 4.4772 66.0290 74.9976 7.4143 7.2000 10.2430 10.5204 8.0559 7.0475 5.6994 8.5997 10.2055 5.0757 4.9138 3.8504 5.8178 9.4794 10.2149 9.2549 6.5455 8.5868 7.7164 1.3320 1.4576 1.3721 1.3501 8.8374 6.5518 9.1529 2.2516 1.6366 1.8131 1.6963 2.2909 4.1126 8.9576 3.7212 4.2629 2.3730 4.0156 9.7503 7.1194 8.5410 9.5736 1.0887 1.0978 1.0931 1.0940
irintensity: 0.0313 0.0019 0.0915 0.0001 0.0977 0.7517 0.0015 0.0009 0.1019 0.0467 0.0023 0.0441 0.0002 0.0076 0.0110 2.2910 0.0698 3.1430 5.1165 6.7654 13.2484 5.2094 6.2504 4.6038 0.1145 4.1774 22.1071 0.5549 25.9061 64.0105 23.0726 2.5325 0.0000 76.5353 35.2206 25.1733 0.0002 0.0461 24.1500 30.1707 1.6944 21.5311 18.2371 48.1121 23.5333 5.5237 34.8925 14.3037 55.8436 33.7223 131.8066 25.9638 101.6748 21.3881 56.2221 54.2480 0.1450 1.2234 1.1642 0.4167
temp: 298.150 k
press: 1.00000 atm
elementType: 35 35 35 35 35 35 6 6 6 6 6 6 6 6 6 6 6 6 1 1 1 1
symmnumber: 1
zpe: 305380.5 jmol-1
zpe.correction: 0.116313 hartree
zpe.thermalcorrener: 0.135044 hartree
zpe.thermalcorrenthalpy: 0.135989 hartree
zpe.thermalcorrgfe: 0.062999 hartree
zpe.sumelectzpe: -539.172062 hartree
zpe.sumelectthermal: -539.153331 hartree
zpe.sumelectthermalent: -539.152387 hartree
zpe.sumelectthermalfe: -539.225376 hartree
dipole: 0.5396 1.1605 0.0004
dipole: 1.2798
quadrupole: -150.3038 -155.9036 -157.9939
quadrupole: 8.0367 0.0033 0.0001
quadrupole: 4.4299 -1.1698 -3.2601 8.0367 0.0033 0.0001
hfenergy: -539.2883753 hartree
pointgroup: C01[X(C12H4Br6)]
dipole: -0.2810136 0.417799 -0.0004829 debye
dipolederiv: -0.181605 0.0249356 0.2398819 0.0248736 0.0153703 -0.0309291 0.2413435 -0.0345334 -0.5427164 -0.1815805 0.0243508 -0.2399238 0.024267 0.0155289 0.0295467 -0.2413764 0.0331689 -0.5429104 -0.0796923 0.2334716 -0.0002699 0.1750061 -0.497202 0.0006173 -0.0001889 0.0006063 0.0427639 -0.236974 -0.3159716 0.0003503 -0.266992 -0.503688 0.0005786 0.0002665 0.0005396 0.0148991 -0.37815 -0.332736 0.0003932 -0.3875957 -0.3142063 0.0003882 0.000466 0.0003906 0.0105662 -0.8000941 0.0896561 -0.0001353 0.1018994 -0.0153821 -0.0000491 -0.0001543 -0.0000515 -0.0611847 0.0804485 0.0175616 -0.0000036 -0.0005305 0.0903964 -0.0008449 0.0000091 -0.0008398 -0.5988166 0.1963516 -0.1289323 0.0001521 -0.0065407 -0.4471109 0.0006152 0.0000095 0.0005929 0.1029384 0.3446482 -0.0659174 -0.4268336 -0.0610509 -0.0989698 0.0524688 -0.2500184 0.0485715 0.9912366 0.3446164 -0.0648706 0.4269591 -0.0604081 -0.099219 -0.0497552 0.2501308 -0.0459132 0.9915351 -0.0588242 -0.3892237 0.0004471 -0.522446 0.7391243 -0.0009291 0.0005884 -0.000892 -0.0825631 0.2944195 0.5816217 -0.0006312 0.4141026 0.8663171 -0.0010891 -0.0003987 -0.0010031 -0.1143377 -0.6124018 0.0676835 0.2442151 0.0745984 -0.043 -0.0301087 0.1544719 -0.0222749 -0.3139225 -0.6123732 0.067089 -0.244402 0.0742178 -0.0428702 0.0294357 -0.1546808 0.0216232 -0.3140861 0.5194979 0.6117089 -0.0007283 0.8789585 0.3481987 -0.00054 -0.0010584 -0.0005581 -0.0876619 -0.131489 -0.1521449 0.0001615 -0.1639688 -0.2115716 0.0001431 0.0001768 0.0001126 -0.0796531 1.4511165 -0.1825918 0.0002664 -0.1996188 -0.0905786 0.0004435 0.0002899 0.0004341 0.2785695 -0.1228876 -0.134802 0.0001591 -0.1585066 -0.0536053 -0.0000204 0.0001883 -0.0000134 -0.0745671 0.0707897 0.0091206 -0.0349734 0.0101377 0.1480839 0.0043692 -0.0360988 0.0045863 0.03675 0.0707858 0.0092058 0.034955 0.0102292 0.1480615 -0.0046464 0.0360763 -0.0048549 0.0367804 0.0565024 0.0226886 -0.0000275 0.0339955 -0.019635 0.0002029 -0.0000439 0.0001923 0.1519958 -0.0331045 0.0080966 -0.0000121 0.0053723 0.0659576 0.0001026 0.0000017 0.000116 0.1543845 unknown
polarizability: 305.5124689|11.4748559|203.3278907|-0.0103313|-0.0150701|184.9859378 unknown
InChI: InChI=1S/C12H4Br6/c13-5-3-8(16)10(9(17)4-5)11-6(14)1-2-7(15)12(11)18/h1-4H
charge 0 multiplicity 1
22 atoms
Br 0.485884 0.086264 2.924215
Br 0.486097 0.079088 -2.924141
Br -0.95466 -2.644775 0.003133
Br -0.21883 3.129698 -0.003407
Br -4.375858 -2.13651 0.002641
Br 5.427467 -0.548218 0.001005
C  0.666857 0.060175 0.000065
C  -0.816642 0.259341 -0.000218
C  1.410327 -0.03249 1.20719
C  1.410443 -0.035407 -1.206769
C  -1.710231 -0.851646 0.001098
C  -1.383101 1.560208 -0.001756
C  2.808308 -0.211271 1.231361
C  2.808418 -0.214251 -1.230389
C  -3.111441 -0.653097 0.000852
C  -2.775751 1.76813 -0.002027
C  3.488073 -0.299738 0.000624
C  -3.639934 0.655933 -0.000733
H  3.34525 -0.27938 2.179465
H  3.345445 -0.284663 -2.178277
H  -3.185011 2.781325 -0.003215
H  -4.723012 0.804586 -0.000917
