program: Gaussian 09
title: 000154485
version: EM64L-G09RevD.01
frameworkgroup: C1[X(C12H5Br5)]
method: RPBEPBE
basis: SDD
operation: Freq
keyword: #pfreq=noraman
keyword: PBEPBE/SDD
title: #p freq=noraman PBEPBE/SDD
converged: NO NO NO NO
title: Mulliken charges:
elementType: Br Br Br Br Br C C C C C C C C C C C C H H H H H
charge: 0.065718 0.065727 0.061589 0.054427 0.067560 0.454469 0.249033 -0.363416 -0.363393 -0.283217 -0.324581 -0.148692 -0.148673 -0.143147 -0.165648 -0.220364 -0.193507 0.268079 0.250670 0.278890 0.278889 0.259588
chargesum: 0.00000
title: Mulliken charges with hydrogens summed into heavy atoms:
elementType: Br Br Br Br Br C C C C C C C C C C C C
charge: 0.065718 0.065727 0.061589 0.054427 0.067560 0.454469 0.249033 -0.363416 -0.363393 -0.015138 -0.073912 0.130197 0.130217 -0.143147 0.093940 -0.220364 -0.193507
polarizability: 3.25763067e+02 -8.46864569e-03 1.80035950e+02 5.07025841e+00 -1.48512316e-02 1.41411596e+02
1716.lowfreq: -4.4527 -0.0004 -0.0003 0.0002 3.5780 5.0693 7.7288 21.3466 24.8180
frequency: 6.9634 21.3456 24.8009 72.4001 97.2840 100.4543 111.4374 122.6995 127.7847 156.1835 166.4723 177.0277 221.1764 243.8898 291.5476 330.1105 351.0766 351.0953 424.3891 427.7884 458.6878 485.1863 504.8110 565.4267 603.2296 644.9770 699.3209 708.2808 709.3774 737.2452 784.6723 823.6672 872.4889 883.8946 892.4704 957.3172 976.5819 1003.5697 1073.5344 1099.4339 1101.7097 1143.7906 1180.1165 1244.6978 1270.4238 1322.0176 1337.1034 1350.6925 1365.1408 1409.1747 1457.6300 1525.1484 1545.7810 1560.6395 1588.8513 3149.5933 3160.3504 3172.9600 3177.0367 3179.2001
redmass: 22.2475 50.1680 40.9515 21.3935 6.1233 31.7677 34.2443 29.3262 12.2238 40.1518 6.5963 4.7627 74.8520 10.5181 7.5492 9.9061 7.7790 10.0248 6.9812 3.6432 4.8893 8.1804 5.1170 3.8644 5.7014 7.0039 9.5666 3.6572 9.7987 6.8774 7.9350 1.3640 1.4340 1.3619 1.4399 1.3536 8.3786 5.2661 6.2122 2.5290 1.8574 1.4275 1.7684 1.4258 2.2185 4.4589 4.5911 3.5867 3.7337 2.6027 3.3746 9.6678 7.8977 8.2345 6.7026 1.0892 1.0928 1.0970 1.0930 1.0939
irintensity: 0.0536 0.0109 0.0011 0.0117 0.4003 0.0229 0.0002 0.0842 0.0403 0.0312 0.1506 0.0484 0.0122 0.3783 3.1089 4.4891 2.6927 14.3531 1.4208 5.9584 2.2301 0.3521 0.0025 10.7653 8.1934 21.9963 48.9029 0.6374 73.5503 3.8370 34.1720 22.3556 28.4514 0.0069 6.1616 0.4616 72.4776 9.5019 8.1716 2.7222 59.8345 0.2471 28.1016 5.7516 7.3730 35.1051 7.5620 34.6714 18.3135 165.2735 3.7393 103.4476 24.5031 109.7399 6.7967 2.7240 1.0219 2.8650 0.8748 0.2107
temp: 298.150 k
press: 1.00000 atm
elementType: 35 35 35 35 35 6 6 6 6 6 6 6 6 6 6 6 6 1 1 1 1 1
symmnumber: 1
zpe: 332275.7 jmol-1
zpe.correction: 0.126557 hartree
zpe.thermalcorrener: 0.143701 hartree
zpe.thermalcorrenthalpy: 0.144645 hartree
zpe.thermalcorrgfe: 0.074437 hartree
zpe.sumelectzpe: -526.388926 hartree
zpe.sumelectthermal: -526.371782 hartree
zpe.sumelectthermalent: -526.370838 hartree
zpe.sumelectthermalfe: -526.441046 hartree
dipole: 1.9095 0.0008 -1.1188
dipole: 2.2131
quadrupole: -148.2061 -144.1464 -139.6128
quadrupole: -0.0025 2.7187 -0.0051
quadrupole: -4.2177 -0.1579 4.3756 -0.0025 2.7187 -0.0051
hfenergy: -526.5154833 hartree
pointgroup: C01 [X(C12H5Br5)]
dipole: 0.7333325 -0.0011211 0.4694183 debye
dipolederiv: -0.1834368 -0.2372422 0.0130766 -0.2424963 -0.5558548 0.0217659 0.0143207 0.0194908 0.0082105 -0.1834698 0.2372068 0.014138 0.2424755 -0.555614 -0.0242607 0.0153873 -0.0219787 0.0080215 -0.200724 0.0006809 -0.2522746 0.0009368 0.0051288 0.001259 -0.3532237 0.0012608 -0.4695045 -0.8192023 -0.0001497 0.0493684 -0.0001864 -0.0593683 -0.0001131 0.0630771 -0.0001082 -0.0071396 -0.7026592 -0.0004985 0.1149902 -0.0005781 0.0079594 0.0000929 0.127872 0.000082 -0.0119663 0.2711896 0.0000377 0.0054135 0.0001206 -0.623647 -0.0013038 -0.0348564 -0.0013306 -0.0199415 0.2484457 0.0000502 -0.0241568 -0.0001777 0.0347993 -0.0002304 0.0508933 -0.0001298 0.1038514 0.3224581 0.4107984 -0.0405708 0.2507507 1.0236607 -0.0377708 -0.0343849 -0.0286804 -0.1146785 0.3225247 -0.4106839 -0.0424215 -0.2506673 1.0232881 0.0428082 -0.0355316 0.0336738 -0.1143595 -0.2613418 0.000541 -0.205712 0.0000886 -0.0496528 0.0004201 -0.0392886 0.0004325 -0.1963176 -0.1343398 -0.0001081 0.0620751 0.0003995 -0.1020063 -0.0003311 -0.1153262 -0.0003602 0.0354247 -0.6433957 -0.2213582 0.0375938 -0.1417819 -0.3085905 0.0140839 0.0479778 0.0168279 -0.0354498 -0.6434371 0.2211681 0.0385787 0.1415402 -0.3084194 -0.0152838 0.0486711 -0.0179802 -0.0355951 0.0469134 -0.001979 0.7009141 -0.0015549 -0.0808193 -0.002378 0.5286361 -0.0024499 0.8162592 -0.3240797 -0.0002348 0.0355526 -0.0001227 -0.0733325 -0.0002001 -0.0113652 -0.0002625 0.0220449 1.4748111 0.0002946 -0.1040488 0.0003407 0.2470225 0.0007753 -0.1247584 0.0007693 -0.1113032 1.1553833 0.0016128 -0.4348728 0.0010507 -0.0985345 0.0001503 -0.1917714 0.0002589 -0.1873397 0.0676556 -0.00017 0.0616094 -0.0001409 0.1263667 0.0003012 0.0712865 0.0002808 0.0164801 0.0266028 0.0001792 -0.0808706 0.0002217 0.1309789 0.0003195 -0.091338 0.0003121 0.0025486 0.0622232 0.0385429 0.0055258 0.0391612 0.0341433 -0.0032535 0.0074339 -0.003435 0.1558056 0.0622198 -0.0385736 0.0053541 -0.0391908 0.034108 0.0027198 0.0072412 0.0028857 0.1558313 0.0356587 -0.0001144 0.0407376 -0.0001892 0.1483836 0.0004292 0.0490472 0.000441 -0.0208825 unknown
polarizability: 325.8761977|0.0107761|180.0358837|2.1997232|0.0530858|141.2985312 unknown
InChI: InChI=1S/C12H5Br5/c13-7-4-10(16)12(11(17)5-7)6-1-2-8(14)9(15)3-6/h1-5H
charge 0 multiplicity 1
22 atoms
Br 0.738226 -2.931152 0.102057
Br 0.737977 2.930774 0.114833
Br -3.8411 0.006592 -2.491169
Br 5.696694 0.000897 -0.278648
Br -5.358236 -0.002699 0.662419
C  0.906078 -0.000166 0.096621
C  -0.589393 -0.000486 0.219895
C  1.655664 -1.207904 0.034432
C  1.655554 1.207922 0.039631
C  -1.397635 0.002495 -0.941629
C  -1.210336 -0.003736 1.493281
C  3.062752 -1.228465 -0.075966
C  3.062628 1.229067 -0.070634
C  -2.806031 0.002146 -0.836943
C  -2.615916 -0.00423 1.599921
C  3.750714 0.000444 -0.126774
C  -3.420358 -0.001403 0.437628
H  -0.932852 0.00503 -1.932172
H  -0.601042 -0.005938 2.402913
H  3.603644 -2.176914 -0.121174
H  3.603473 2.177732 -0.111645
H  -3.091407 -0.006805 2.584822
