program: Gaussian 09
title: 000154479
version: EM64L-G09RevD.01
frameworkgroup: C1[X(C19H20N4O2)]
method: RPBEPBE
basis: SDD
operation: Freq
keyword: #p
keyword: freq=noraman
keyword: PBEPBE/SDD
title: #p freq=noraman PBEPBE/SDD
converged: YES YES NO NO
title: Mulliken charges:
elementType: O O N N N N C C C C C C C C C C C C C C C C C C C H H H H H H H H H H H H H H H H H H H H
charge: -0.332628 -0.431271 -0.312781 -0.413713 -0.060518 -0.088036 0.110254 0.048218 0.211510 -0.031326 0.318222 0.188588 0.194315 0.104363 -0.321436 -0.383753 -0.361038 -0.284653 -0.574042 -0.396274 -0.794174 -0.384202 0.299437 -0.614924 -0.615397 0.248060 0.246277 0.372886 0.235952 0.217197 0.255808 0.282800 0.193076 0.226790 0.234918 0.273041 0.235074 0.257348 0.223129 0.190784 0.228946 0.223099 0.191736 0.226066 0.362273
chargesum: 0.00000
title: Mulliken charges with hydrogens summed into heavy atoms:
elementType: O O N N N N C C C C C C C C C C C C C C C C C C C
charge: -0.332628 -0.068998 -0.312781 -0.040827 -0.060518 -0.088036 0.110254 0.048218 0.211510 -0.031326 0.318222 0.188588 0.194315 0.104363 -0.073376 -0.137477 0.092112 -0.028845 -0.291241 0.023592 -0.051141 -0.126854 0.299437 0.027934 0.025505
polarizability: 3.91102143e+02 1.70023204e+01 3.01301863e+02 3.02040065e+00 1.08857237e-01 1.19589055e+02
1716.lowfreq: 0.0003 0.0004 0.0008 3.6279 5.9944 9.7412 23.3263 27.0275 43.0024
frequency: 23.2159 26.7452 42.9596 61.1756 80.6149 82.3020 105.3188 149.2931 157.4297 161.4844 185.1772 193.3703 203.7238 211.2975 229.1677 243.3839 261.8853 271.1888 302.5707 311.6835 332.8581 353.7960 379.9765 381.2463 382.8368 395.1616 401.7594 421.1718 429.7207 442.9614 479.6283 492.2075 500.2002 547.5657 561.4335 601.1251 605.6371 641.1341 648.5549 653.9735 681.6873 697.9277 728.7324 746.0027 770.5833 795.1927 797.5621 802.8393 815.0054 821.0664 822.0501 846.8255 905.9064 943.6783 951.5837 956.0598 962.1552 994.5705 1016.5649 1032.7058 1033.4331 1045.2741 1059.7851 1067.4549 1082.2060 1089.9836 1103.0387 1126.8109 1134.6978 1140.3267 1164.4049 1181.4133 1212.4300 1218.0013 1228.0514 1246.6318 1259.0060 1267.9559 1271.0806 1300.8138 1306.5970 1325.5354 1336.6405 1371.1399 1385.0770 1390.6281 1396.3676 1402.2297 1418.8926 1420.2572 1443.0622 1445.8195 1461.3404 1466.5601 1467.2719 1474.0679 1475.4949 1478.2517 1480.2708 1485.0391 1487.6164 1492.2879 1514.8148 1529.5814 1563.1401 1588.0443 1607.6185 1629.5692 1660.9785 2843.5600 2854.3044 2869.7051 2956.2079 2977.8742 3003.7642 3022.5713 3031.1072 3034.0942 3053.8459 3080.7784 3087.6365 3117.8792 3122.9870 3151.2234 3168.5131 3172.2316 3204.6598 3249.5024 3583.3727
redmass: 2.8966 3.7140 4.3869 6.0431 3.6691 3.6297 2.0426 4.3578 3.7592 6.0554 5.1252 3.8124 3.1824 1.1215 4.4105 1.3449 1.1470 3.0874 5.0962 3.9087 6.0142 2.5953 4.9629 7.7705 1.1329 8.3791 3.4155 2.6826 3.3188 5.2641 3.8566 4.0612 5.0841 5.4725 3.7375 5.9840 6.1681 3.6241 6.2266 5.5793 5.7893 4.1991 6.6526 5.8128 1.4702 2.0245 2.7832 2.3750 6.1218 1.4828 1.5367 4.8625 1.4925 5.1917 1.3419 1.3450 4.6473 2.0797 4.6243 2.4790 1.5276 1.4558 2.6346 1.7653 2.1038 1.3514 2.5572 1.8715 1.6032 1.5557 1.3263 1.6045 2.2680 2.4805 3.3597 1.6269 2.8454 2.5805 2.6785 1.2187 2.0305 1.5952 2.3238 2.6614 6.0283 1.5723 1.3416 5.9408 1.6436 1.7884 1.2571 2.6685 1.0490 1.2165 1.2152 1.0458 1.0849 1.1891 2.8798 1.0584 3.2581 1.1176 4.7204 6.6129 3.0577 6.1028 3.8982 7.1340 9.6280 1.0690 1.0569 1.0578 1.0592 1.0392 1.0975 1.0733 1.0743 1.0912 1.0984 1.1011 1.1004 1.0958 1.0915 1.0879 1.0905 1.0957 1.0933 1.0815 1.0661
irintensity: 0.1360 0.5643 0.3152 0.6367 0.8558 0.4686 1.7825 0.0871 0.6019 0.5490 3.3237 0.4006 1.3493 1.7582 2.4771 0.4723 0.2827 0.5726 0.1503 22.7702 14.6579 4.8547 4.8919 1.2925 140.8155 1.2659 2.1302 1.4372 3.2558 7.5456 6.1590 16.1806 7.2985 3.7567 9.4172 15.7315 8.9481 3.9483 7.7850 0.0958 22.5315 10.7797 10.7277 0.5055 43.7399 0.7287 55.6303 7.1593 49.8051 2.9355 62.3287 9.1323 22.8486 2.7972 0.0311 1.1013 6.2274 15.3716 0.3129 42.7122 14.8348 2.6806 8.0637 1.5864 46.7826 6.2884 1.3846 51.6423 259.6006 4.5132 40.1592 14.3551 10.6905 20.7541 156.1331 4.9398 32.5676 10.9101 63.8832 4.0354 37.2176 43.6874 22.4927 3.9637 28.2346 1.9644 2.7757 38.7955 13.7205 30.4091 13.0350 6.0072 16.8079 92.1854 36.8098 19.8383 66.7631 27.7296 111.0087 22.7701 78.2652 58.3375 18.4917 332.9325 93.0512 29.6064 375.5840 27.3391 145.6035 67.6081 67.4266 214.3934 72.5561 29.9500 15.8970 43.7109 49.4902 36.1328 15.5678 29.2397 60.2276 7.1546 12.6676 4.6654 3.1082 18.8255 5.5495 60.6589 58.6825
temp: 298.150 k
press: 1.00000 atm
elementType: 8 8 7 7 7 7 6 6 6 6 6 6 6 6 6 6 6 6 6 6 6 6 6 6 6 1 1 1 1 1 1 1 1 1 1 1 1 1 1 1 1 1 1 1 1
symmnumber: 1
zpe: 941272.3 jmol-1
zpe.correction: 0.358512 hartree
zpe.thermalcorrener: 0.380896 hartree
zpe.thermalcorrenthalpy: 0.381840 hartree
zpe.thermalcorrgfe: 0.306595 hartree
zpe.sumelectzpe: -1103.709315 hartree
zpe.sumelectthermal: -1103.686931 hartree
zpe.sumelectthermalent: -1103.685987 hartree
zpe.sumelectthermalfe: -1103.761231 hartree
dipole: -1.2629 1.6055 0.4875
dipole: 2.1001
quadrupole: -119.3765 -148.2528 -150.6892
quadrupole: -3.3885 -2.8808 -1.3065
quadrupole: 20.0630 -8.8133 -11.2497 -3.3885 -2.8808 -1.3065
hfenergy: -1104.0678268 hartree
pointgroup: C01 [X(C19H20N4O2)]
dipole: 0.4668551 -0.644827 0.2211449 debye
polarizability: 392.4633741|12.9040707|299.6959244|-1.4682093|-7.0373595|119.8337621 unknown
InChI: InChI=1S/C19H20N4O2/c1-11-21-15-6-5-14(20-8-9-22(2)3)17-18(15)23(11)16-7-4-12(24)10-13(16)19(17)25/h4-7,10,20,24H,8-9H2,1-3H3
charge 0 multiplicity 1
45 atoms
O  0.553458 -1.975128 0.080053
O  -4.112501 -4.121288 0.237022
N  -2.215245 1.20587 -0.048845
N  2.523703 -0.073677 -0.041092
N  -1.847753 3.473712 -0.165925
N  6.226412 -0.818026 -0.045909
C  -0.835503 1.403734 -0.075533
C  0.151766 0.405169 -0.037671
C  -2.714499 -0.123729 0.023439
C  -0.604217 2.794653 -0.147582
C  1.523063 0.866707 -0.077125
C  -1.756014 -1.196792 0.065496
C  -2.797281 2.526301 -0.10716
C  -0.274826 -0.978092 0.037934
C  0.740777 3.236988 -0.186614
C  1.77949 2.283726 -0.151807
C  3.955932 0.235173 -0.070588
C  -4.100365 -0.431404 0.055162
C  -2.217665 -2.534544 0.137153
C  4.770394 -1.07527 -0.053937
C  -4.264887 2.820036 -0.103335
C  -4.537071 -1.762144 0.125921
C  -3.592494 -2.819301 0.166841
C  7.006532 -1.954938 -0.578212
C  6.735612 -0.375839 1.26945
H  0.972667 4.305344 -0.244004
H  2.815835 2.631104 -0.184594
H  2.187749 -1.054865 0.017174
H  4.222715 0.803761 -0.9838
H  4.226271 0.868583 0.799617
H  -4.845706 0.363714 0.024942
H  -1.450312 -3.318824 0.167376
H  4.44448 -1.700692 0.818005
H  4.52577 -1.646866 -0.969039
H  -4.763778 2.463402 0.817323
H  -4.381004 3.91316 -0.155411
H  -4.786032 2.376034 -0.972226
H  -5.603391 -2.004465 0.150485
H  8.072944 -1.672916 -0.639855
H  6.932214 -2.879642 0.048422
H  6.66087 -2.201649 -1.597511
H  6.208054 0.533454 1.604319
H  6.622212 -1.154731 2.066262
H  7.808088 -0.127044 1.183399
H  -3.384463 -4.790855 0.25958
