program: Gaussian 09
title: 000154478
version: EM64L-G09RevD.01
frameworkgroup: C1[X(C12H4Br6)]
method: RPBEPBE
basis: SDD
operation: Freq
keyword: #pfreq=noraman
keyword: PBEPBE/SDD
title: #p freq=noraman PBEPBE/SDD
converged: YES YES NO NO
title: Mulliken charges:
elementType: Br Br Br Br Br Br C C C C C C C C C C C C H H H H
charge: 0.110145 0.060279 0.127939 0.083232 0.131193 0.039138 0.384158 0.348055 -0.371442 -0.309930 -0.365485 -0.313544 -0.116066 -0.154055 -0.189265 -0.137409 -0.187823 -0.216519 0.281371 0.258664 0.277636 0.259727
chargesum: 0.00000
title: Mulliken charges with hydrogens summed into heavy atoms:
elementType: Br Br Br Br Br Br C C C C C C C C C C C C
charge: 0.110145 0.060279 0.127939 0.083232 0.131193 0.039138 0.384158 0.348055 -0.371442 -0.028559 -0.365485 -0.054880 -0.116066 -0.154055 -0.189265 0.140227 0.071904 -0.216519
polarizability: 3.42942811e+02 8.67909219e+00 2.13175249e+02 1.94018672e+01 -4.16898202e+00 1.53583614e+02
1716.lowfreq: -0.0003 -0.0002 0.0000 0.6519 2.6709 4.2229 11.8889 24.0244 25.1552
frequency: 11.8713 24.0148 25.1513 43.2892 51.9622 97.2581 105.4215 129.2225 135.6941 143.2199 145.0742 157.8362 160.9003 206.3146 215.7341 239.3553 282.9910 299.0113 303.8273 360.5007 420.1969 425.0376 449.5837 492.8591 532.0795 533.8869 578.0851 621.4118 647.8323 697.6815 715.5377 724.9786 741.0972 803.9602 826.1246 877.4607 884.2521 956.6496 977.5831 1019.4105 1067.9932 1087.9279 1139.6960 1153.8990 1234.6076 1254.4266 1303.0221 1322.1725 1335.3770 1362.2022 1380.7245 1455.3629 1500.6421 1549.0340 1554.2715 1586.5189 3149.1850 3174.5060 3178.4589 3184.5231
redmass: 25.7389 41.4260 24.5990 72.3164 31.1762 38.2006 7.1124 32.5359 47.5958 8.6254 15.6280 12.0434 35.6954 67.2536 68.5572 6.4503 13.0988 7.7437 7.7024 10.6233 6.6360 3.5673 9.2193 7.0059 10.6134 5.9977 3.8501 9.8198 7.8146 9.4909 5.7666 5.9868 6.2288 8.4892 1.4233 1.4121 1.4382 1.3564 9.5146 6.3144 4.4827 2.6762 1.4200 2.1190 2.3367 1.7378 4.0978 6.6257 3.9680 4.1150 3.6128 3.0932 10.1634 8.1400 7.5090 7.5738 1.0897 1.0929 1.0962 1.0935
irintensity: 0.0423 0.0095 0.0423 0.0009 0.0100 0.0639 0.4033 0.1430 0.2627 0.1553 0.0908 0.1951 0.0391 0.0531 0.0213 3.3298 2.5170 1.4677 0.9440 14.1770 0.4578 1.8382 9.4072 4.8307 15.6239 4.8734 18.6616 2.0736 2.4649 49.4887 33.3865 0.6173 33.4411 9.4838 21.7472 12.6166 10.6792 0.1289 32.3422 50.0827 38.2831 5.0437 0.6988 64.9288 34.1476 26.9814 38.0911 33.0336 12.7921 38.3061 124.4346 77.1270 28.9072 27.0775 6.0907 47.6563 3.5750 0.3733 1.4777 0.5225
temp: 298.150 k
press: 1.00000 atm
elementType: 35 35 35 35 35 35 6 6 6 6 6 6 6 6 6 6 6 6 1 1 1 1
symmnumber: 1
zpe: 305280.5 jmol-1
zpe.correction: 0.116275 hartree
zpe.thermalcorrener: 0.135000 hartree
zpe.thermalcorrenthalpy: 0.135944 hartree
zpe.thermalcorrgfe: 0.062032 hartree
zpe.sumelectzpe: -539.165988 hartree
zpe.sumelectthermal: -539.147263 hartree
zpe.sumelectthermalent: -539.146319 hartree
zpe.sumelectthermalfe: -539.220231 hartree
dipole: -0.8461 0.7064 -1.3341
dipole: 1.7305
quadrupole: -160.3905 -157.9627 -154.7703
quadrupole: -1.1651 2.1336 -1.2323
quadrupole: -2.6827 -0.2549 2.9375 -1.1651 2.1336 -1.2323
hfenergy: -539.2822629 hartree
pointgroup: C01 [X(C12H4Br6)]
dipole: -0.3520537 0.2524147 -0.5252597 debye
dipolederiv: -0.1713656 -0.2908034 0.0080904 -0.3025064 -0.4377357 0.0151884 0.0040387 0.0104124 0.0392487 -0.1815996 0.0041446 -0.2153971 0.0023389 0.0045424 0.008693 -0.2416775 0.0081212 -0.5348477 -0.1557024 0.2971505 -0.0043468 0.3326692 -0.4059654 0.0108974 -0.0129885 0.0170551 0.0433943 -0.1085475 -0.2189446 0.0154595 -0.3031226 -0.5872032 0.0364349 0.0143076 0.0314123 0.016413 -0.6495257 -0.0710059 0.0138959 -0.0475374 0.0730864 -0.0008283 0.0021732 -0.0005211 0.0509521 -0.8391344 0.0282821 -0.0861164 0.0211294 -0.0150981 0.0032691 -0.0409036 0.0019095 -0.0639034 0.3208061 -0.1573081 -0.0595159 -0.1431026 -0.0742847 -0.0034324 -0.0449239 0.0040283 0.0310272 0.2280351 -0.058145 -0.1694196 -0.0597976 -0.0124339 0.012161 -0.0769335 0.0035835 -0.3068235 0.0633214 0.5461239 0.0007866 0.6378701 0.5785147 -0.0104498 -0.0088287 -0.0366149 -0.0890928 -0.2189048 -0.0839592 0.0184158 -0.0559738 -0.2649668 0.0153562 0.0003972 0.031099 -0.0599382 0.2472133 0.0008427 0.4778992 0.0112108 -0.1057044 -0.0422318 0.2499972 -0.0049731 0.9710599 -0.0188159 0.0041066 0.0548161 -0.0053664 -0.098382 0.0178679 0.1630333 -0.0041219 0.0824658 -0.0323332 -0.5825649 0.0176153 -0.6831042 0.5570675 -0.0191061 0.0265778 -0.021222 -0.0429191 -0.0684889 0.4674848 -0.0225069 0.4067073 1.0176573 -0.0660767 -0.0040801 -0.0546337 -0.0815435 0.9897443 0.0738003 -0.0054247 0.1200558 -0.4512767 0.0189976 -0.0041394 0.015578 -0.071731 -0.581681 0.0209097 -0.2647646 0.0207126 -0.0286422 0.0119517 -0.189676 0.0020207 -0.272975 -0.5162851 0.0160446 0.0752578 0.0262942 -0.0878891 -0.0026629 0.0046804 -0.0037291 -0.0202497 1.5027296 -0.0450777 0.1077119 -0.0420698 -0.1198552 -0.0093297 0.0996048 -0.0035123 0.1558493 0.0606605 0.0411909 -0.0075313 0.0673112 0.0230727 -0.0017193 -0.008792 0.0023658 0.1320245 0.0294895 -0.0020606 0.0621276 -0.0039402 0.1290219 -0.0010594 0.0881434 -0.0044314 -0.0142124 0.0575447 0.0037722 0.041389 -0.0013547 0.1506286 0.0017638 0.0412809 0.0000974 0.0367392 0.0428396 0.0060165 -0.058442 0.0015761 0.155846 0.0043154 -0.0612914 0.0060763 -0.0009378 unknown
polarizability: 343.5867702|11.168421|213.0713796|13.6363035|-6.5075816|153.0435236 unknown
InChI: InChI=1S/C12H4Br6/c13-5-1-2-6(8(14)3-5)7-4-9(15)11(17)12(18)10(7)16/h1-4H
charge 0 multiplicity 1
22 atoms
Br 0.167234 -2.800056 0.000864
Br -1.109826 0.044713 2.794837
Br 3.565508 -2.692067 0.007645
Br 3.229323 3.167461 -0.255648
Br 5.136875 0.313202 -0.118461
Br -5.941721 0.209541 -0.379994
C  0.341831 0.090912 -0.112439
C  -1.155968 0.091809 -0.141769
C  1.113226 -1.100002 -0.062381
C  1.016348 1.331314 -0.171793
C  -1.953683 0.090903 1.030007
C  -1.826485 0.13924 -1.392074
C  2.532875 -1.047909 -0.062211
C  2.422521 1.394706 -0.17337
C  3.199818 0.210878 -0.117091
C  -3.363863 0.124362 0.976625
C  -3.233955 0.173089 -1.479901
C  -3.986152 0.163291 -0.287793
H  0.431841 2.253961 -0.209218
H  -1.22989 0.141453 -2.310284
H  -3.955114 0.121467 1.895104
H  -3.729144 0.205031 -2.453753
