program: Gaussian 09
title: 000154473
version: EM64L-G09RevD.01
frameworkgroup: C1[X(C12H11N3O2)]
method: RPBEPBE
basis: SDD
operation: Freq
keyword: #p
keyword: freq=noraman
keyword: PBEPBE/SDD
title: #p freq=noraman PBEPBE/SDD
converged: NO YES NO NO
title: Mulliken charges:
elementType: O O N N N C C C C C C C C C C C C H H H H H H H H H H H
charge: -0.220180 -0.190979 0.005115 -0.697585 -0.720213 0.010379 0.276761 0.291326 0.454003 -0.694162 -0.705647 0.663797 -0.352565 -0.352559 -0.223505 -0.223505 -0.242384 0.278469 0.213818 0.242678 0.242681 0.225476 0.225476 0.302041 0.339064 0.226716 0.317356 0.308127
chargesum: 0.00000
title: Mulliken charges with hydrogens summed into heavy atoms:
elementType: O O N N N C C C C C C C C C C C C
charge: -0.220180 -0.190979 0.005115 -0.056479 -0.094730 0.010379 0.276761 0.291326 0.454003 -0.415693 -0.491829 0.663797 -0.109887 -0.109878 0.001971 0.001971 -0.015667
polarizability: 2.42503977e+02 9.46733777e-01 1.54218038e+02 7.42131318e-03 3.69215977e-03 1.04088534e+02
1716.lowfreq: -32.0785 -8.2617 -2.1539 -0.0009 -0.0009 -0.0006 5.2153 37.3625 49.9321
frequency: -32.0670 37.1444 49.9139 72.3328 131.3798 187.9177 192.1786 212.4889 253.6363 271.0276 304.7371 364.1165 369.9724 398.5062 398.5996 399.7987 413.5022 428.5828 458.7733 494.8501 511.4522 528.6653 571.3156 613.4143 621.6915 630.9710 702.5005 703.5482 712.2842 724.0733 751.6231 768.6733 849.0723 855.1904 884.0401 907.8082 925.8468 978.8224 984.5566 989.2730 995.6256 1012.7067 1033.1635 1038.1130 1075.4317 1080.0406 1164.0524 1171.3343 1185.7965 1203.7167 1255.9973 1268.0607 1307.4328 1359.2203 1364.7011 1366.0701 1400.1748 1428.3109 1471.5779 1479.6906 1522.8609 1568.9277 1581.2917 1608.6355 1627.0480 1642.6548 1647.6645 3116.9967 3122.1272 3128.2684 3140.4654 3149.3500 3164.1809 3180.7785 3552.4867 3570.4781 3699.4123 3710.8912
redmass: 9.9112 4.4674 5.0276 5.5702 5.4472 7.0263 4.4298 3.9403 5.5694 4.6461 3.8285 1.1776 1.0972 6.4201 1.2913 2.3642 5.9746 3.5201 1.1816 3.5765 4.5738 4.7606 6.4569 6.4402 3.8106 2.7308 1.7623 5.3197 5.5083 11.3902 3.4536 1.9337 1.5136 1.2620 2.5612 4.1172 1.6196 1.3865 6.2699 4.9076 1.4180 2.7220 1.6852 1.7745 1.6040 1.4134 1.8431 1.0522 1.1306 11.3720 1.7683 2.9611 1.3875 3.4814 6.2750 11.0380 6.6107 2.2279 2.6990 3.8497 5.1356 6.3675 6.0036 6.0333 1.2116 1.9333 2.0313 1.0911 1.0843 1.0877 1.0925 1.0969 1.1018 1.0916 1.0454 1.0450 1.1035 1.1041
irintensity: 0.0107 0.0284 1.3484 1.6940 1.3922 1.2181 0.0416 5.4626 2.4198 1.0132 4.7571 19.4191 91.8666 0.7161 311.1333 51.9983 6.7285 17.3653 32.2489 5.9654 0.0514 4.1989 0.9096 0.9342 7.7325 7.3966 44.8112 1.7635 4.4555 16.6038 7.8739 53.2935 1.6422 0.6300 89.8583 5.9903 4.9245 0.3122 1.8319 10.0166 0.5509 0.2567 14.7162 0.8294 11.0239 11.2157 17.9531 0.0275 3.9142 260.6392 77.6657 8.8582 0.1177 41.1335 0.0006 203.4539 69.8719 6.2178 44.8996 39.2341 66.7308 19.7935 1.8329 4.3789 119.7188 79.6576 478.4419 23.9366 2.0123 0.5267 18.1185 38.0694 26.0999 6.6270 72.1130 86.3976 38.6575 23.2393
temp: 298.150 k
press: 1.00000 atm
elementType: 8 8 7 7 7 6 6 6 6 6 6 6 6 6 6 6 6 1 1 1 1 1 1 1 1 1 1 1
symmnumber: 1
zpe: 556562.7 jmol-1
zpe.correction: 0.211984 hartree
zpe.thermalcorrener: 0.226143 hartree
zpe.thermalcorrenthalpy: 0.227087 hartree
zpe.thermalcorrgfe: 0.170906 hartree
zpe.sumelectzpe: -777.310155 hartree
zpe.sumelectthermal: -777.295996 hartree
zpe.sumelectthermalent: -777.295051 hartree
zpe.sumelectthermalfe: -777.351232 hartree
dipole: 2.4355 -6.8215 0.0028
dipole: 7.2433
quadrupole: -70.6437 -102.2451 -96.3997
quadrupole: -4.3446 0.0110 -0.0065
quadrupole: 19.1191 -12.4823 -6.6369 -4.3446 0.0110 -0.0065
hfenergy: -777.5221382 hartree
pointgroup: C01 [X(C12H11N3O2)]
dipole: 1.0960221 2.6305145 -0.0009583 debye
polarizability: 242.1688044|-5.5113048|154.5532033|-0.0292036|0.0110313|104.088541 unknown
InChI: InChI=1S/C12H11N3O2/c13-9-6-10(14)12(11(7-9)15(16)17)8-4-2-1-3-5-8/h1-7H,13-14H2
charge 0 multiplicity 1
28 atoms
O  1.35068 -3.262724 -0.001572
O  -0.748353 -2.39803 0.000297
N  0.533629 -2.257292 -0.000418
N  0.195551 2.702878 -0.000018
N  4.556805 0.52128 -0.000726
C  0.277282 0.260971 -0.000169
C  -1.225839 0.267974 -0.000004
C  1.117477 -0.883885 -0.000384
C  0.950666 1.533497 -0.000227
C  2.526371 -0.828766 -0.00066
C  2.36776 1.609539 -0.000483
C  3.165691 0.437538 -0.000659
C  -1.947534 0.326223 -1.221426
C  -1.947325 0.326137 1.221544
C  -3.3584 0.403108 -1.221755
C  -3.358183 0.403036 1.222114
C  -4.069311 0.439188 0.000241
H  3.09278 -1.762721 -0.000838
H  2.850669 2.595231 -0.000468
H  -1.399585 0.289447 -2.169764
H  -1.399214 0.289277 2.169783
H  -3.901375 0.430766 -2.173354
H  -3.900998 0.430632 2.173806
H  0.645004 3.6131 -0.000225
H  -0.820219 2.651779 0.000052
H  -5.16379 0.493015 0.00034
H  5.124675 -0.320524 -0.001449
H  5.028285 1.420426 -0.001579
