program: Gaussian 09
title: 000154470
version: EM64L-G09RevD.01
frameworkgroup: C1[X(C17H11N7O4)]
method: RPBEPBE
basis: SDD
operation: Freq
keyword: #p
keyword: freq=noraman
keyword: PBEPBE/SDD
title: #p freq=noraman PBEPBE/SDD
converged: NO YES NO NO
title: Mulliken charges:
elementType: O O O O N N N N N N N C C C C C C C C C C C C C C C C C H H H H H H H H H H H
charge: -0.197260 -0.197256 -0.198836 -0.198831 -0.347615 -0.048274 -0.017201 -0.048062 -0.610056 0.025170 0.027471 0.029081 0.089314 0.491320 -0.046377 0.354920 -0.321246 -0.321321 0.117841 -0.350609 -0.350123 -0.350963 -0.350884 0.399241 -0.349032 -0.349117 0.379487 -0.387296 0.258536 0.258528 0.252687 0.252474 0.293184 0.293183 0.291916 0.291927 0.249812 0.345999 0.338267
chargesum: 0.00000
title: Mulliken charges with hydrogens summed into heavy atoms:
elementType: O O O O N N N N N N N C C C C C C C C C C C C C C C C C
charge: -0.197260 -0.197256 -0.198836 -0.198831 -0.347615 -0.048274 -0.017201 -0.048062 0.074210 0.025170 0.027471 0.029081 0.089314 0.491320 -0.046377 0.354920 -0.062711 -0.062793 0.117841 -0.097922 -0.097648 -0.057779 -0.057701 0.399241 -0.057115 -0.057190 0.379487 -0.137484
polarizability: 3.38920940e+02 -2.57567632e+01 2.57307820e+02 2.97672001e-02 -1.31013384e-01 1.94251740e+02
1716.lowfreq: -55.4209 -43.9753 -9.3484 -4.3625 -0.0010 -0.0009 -0.0005 2.2164 18.5938
frequency: -55.3542 -43.9643 18.5880 34.3547 42.5067 44.2823 60.6212 61.4237 113.5782 126.3252 128.4374 170.4858 204.9970 206.0382 217.7134 243.7179 259.0533 270.0377 308.6886 363.9673 366.1216 402.2729 408.6858 441.5279 448.5705 451.9484 488.4662 503.5991 505.3963 513.8545 526.3526 535.9539 551.3849 569.9665 608.3775 617.9641 627.8973 631.3368 663.5024 665.2710 671.3489 676.7508 704.2320 720.9470 728.0617 749.6013 771.3075 790.3470 796.8236 804.0174 843.6601 850.2060 853.3712 866.7657 889.6543 932.5403 947.4405 971.3321 986.6096 989.2495 993.8299 996.1324 1006.7158 1007.1834 1087.4711 1090.1846 1094.3864 1097.7357 1102.9348 1106.7044 1172.4227 1181.5935 1204.7308 1216.6672 1220.6854 1247.9710 1281.2858 1287.6452 1293.5709 1300.9907 1319.5808 1360.8300 1361.0695 1366.8667 1389.8435 1398.1202 1402.0928 1405.6425 1414.2027 1437.9223 1454.0356 1486.7776 1513.8943 1536.4179 1580.4608 1592.3520 1601.2725 1608.7296 1615.4309 1635.6514 3153.4719 3155.2817 3163.6098 3164.8901 3168.7620 3185.1583 3187.7391 3187.7776 3190.4295 3539.1867 3693.3940
redmass: 4.3740 4.2461 12.7178 7.0002 7.6124 8.6523 10.6992 10.6243 8.0206 7.3644 6.2968 8.4006 8.8432 9.3434 7.2233 7.2005 5.4984 6.6116 6.4119 5.4171 5.6538 2.8685 2.8787 8.2935 8.2424 5.9192 4.0342 7.3840 4.4688 5.1044 1.2271 6.5889 1.1812 3.5964 5.3306 7.0529 7.2195 7.9898 10.0840 4.7851 4.7350 6.2190 8.7344 10.7086 4.9808 4.9745 6.6917 9.1720 11.6646 7.1208 1.2415 2.9740 1.2404 1.6503 3.0557 1.4329 5.9496 2.5042 1.3612 1.3540 1.3783 1.3744 2.9190 3.0838 5.9429 3.4819 4.9571 2.8296 1.2745 1.3126 1.2355 1.3031 3.7798 6.8523 6.6030 6.5078 4.1864 1.2652 1.2725 7.9567 8.8854 6.1619 1.9171 7.4800 10.6937 9.9387 3.6648 3.9948 4.1695 3.0631 3.0602 3.0240 5.1554 8.5044 2.0371 8.0549 8.3445 6.3427 4.2429 3.2201 1.0908 1.0909 1.0909 1.0908 1.0922 1.0949 1.0962 1.0955 1.0968 1.0445 1.1055
irintensity: 0.0825 0.0294 0.3048 0.9763 0.5640 1.6106 0.0723 0.0028 3.1415 4.5811 3.5518 7.1283 1.1257 0.0054 2.8688 1.4208 4.5157 0.8990 0.3647 1.5220 1.8715 0.0059 0.0419 3.9571 0.0210 9.3036 11.0260 1.5674 0.7319 14.3820 225.8193 3.7104 18.6673 15.4920 4.3605 1.3667 0.4141 6.1390 17.2263 24.5867 26.4044 25.1330 8.4612 2.0559 9.3547 1.1292 47.9572 36.3637 4.0779 10.1598 0.0669 15.7391 0.4412 51.8475 31.4865 10.8795 25.4629 1.2093 5.0376 1.3933 0.0016 0.0524 11.4239 14.1905 28.4721 7.6954 11.3371 12.1896 10.2186 22.8729 30.0266 43.8751 39.8119 257.8591 352.0040 41.3115 135.8560 0.2761 0.0927 33.6967 48.3056 48.9157 76.9369 85.0395 17.6743 0.3297 82.4548 66.5447 66.6092 7.3415 24.7094 86.4181 13.4720 78.9092 70.0263 1.6168 3.5750 111.0302 100.1860 508.5784 4.2650 2.3952 2.6878 2.3512 14.2786 0.3437 5.0887 0.9169 6.9155 146.8723 52.0203
temp: 298.150 k
press: 1.00000 atm
elementType: 8 8 8 8 7 7 7 7 7 7 7 6 6 6 6 6 6 6 6 6 6 6 6 6 6 6 6 6 1 1 1 1 1 1 1 1 1 1 1
symmnumber: 1
zpe: 707048.4 jmol-1
zpe.correction: 0.269301 hartree
zpe.thermalcorrener: 0.290060 hartree
zpe.thermalcorrenthalpy: 0.291004 hartree
zpe.thermalcorrgfe: 0.217473 hartree
zpe.sumelectzpe: -1336.488939 hartree
zpe.sumelectthermal: -1336.468180 hartree
zpe.sumelectthermalent: -1336.467236 hartree
zpe.sumelectthermalfe: -1336.540767 hartree
dipole: 4.9688 -3.7556 0.0005
dipole: 6.2285
quadrupole: -195.7010 -184.9086 -148.6566
quadrupole: -13.5270 0.0058 -0.0240
quadrupole: -19.2790 -8.4865 27.7655 -13.5270 0.0058 -0.0240
hfenergy: -1336.75824 hartree
pointgroup: C01 [X(C17H11N7O4)]
dipole: 1.9364466 1.5016511 -0.0005459 debye
polarizability: 338.2705591|26.7594266|257.958143|-0.035582|-0.1447226|194.2517974 unknown
InChI: InChI=1S/C17H11N7O4/c18-15-14-17(20-9-19-15)22(11-5-7-13(8-6-11)24(27)28)16(21-14)10-1-3-12(4-2-10)23(25)26/h1-9H,18H2
charge 0 multiplicity 1
39 atoms
O  -2.061264 -5.30678 1.140959
O  -2.060654 -5.307183 -1.140676
O  -5.279201 2.88119 -1.140818
O  -5.280735 2.875199 1.140646
N  1.375531 -0.006978 0.000144
N  1.927382 2.2236 -0.000204
N  3.670171 -0.97956 0.000589
N  5.40788 0.764452 0.000233
N  4.912516 3.07459 -0.000313
N  -1.73428 -4.800537 0.000138
N  -4.694944 2.730726 -0.000079
C  0.913453 1.338345 0.000002
C  2.781043 0.050862 0.00033
C  0.580647 -1.209745 0.000139
C  3.091869 1.437199 -0.000031
C  -0.534106 1.680322 -0.000045
C  0.208136 -1.799073 1.230281
C  0.208395 -1.799235 -1.230006
C  4.477998 1.777732 -0.000084
C  -1.225278 1.860633 -1.225836
C  -1.226993 1.853961 1.225752
C  -0.555952 -2.981387 1.236857
C  -0.555694 -2.981553 -1.236585
C  -0.927852 -3.550565 0.000134
C  -2.590596 2.205416 -1.235406
C  -2.592315 2.198705 1.235308
C  -3.25294 2.366219 -0.000064
C  4.962343 -0.529374 0.000577
H  0.5289 -1.33901 2.16958
H  0.529293 -1.339258 -2.1693
H  -0.686824 1.744354 -2.171772
H  -0.689881 1.73254 2.17181
H  -0.860833 -3.466947 2.167073
H  -0.860368 -3.467242 -2.166802
H  -3.143039 2.353641 -2.166579
H  -3.146035 2.341899 2.166509
H  5.739919 -1.298712 0.000677
H  4.240914 3.839337 -0.000467
H  5.913997 3.258018 -0.00027
