program: Gaussian 09
title: 000154459
version: EM64L-G09RevD.01
frameworkgroup: C1[X(C17H11Br)]
method: RPBEPBE
basis: SDD
operation: Freq
keyword: #p
keyword: freq=noraman
keyword: PBEPBE/SDD
title: #p freq=noraman PBEPBE/SDD
converged: NO YES NO NO
title: Mulliken charges:
elementType: Br C C C C C C C C C C C C C C C C C H H H H H H H H H H H
charge: -0.053809 -0.505231 0.295960 0.273169 0.248853 0.248068 0.417046 0.447897 -0.444295 -0.426117 -0.400207 -0.392548 -0.430767 -0.432380 -0.224341 -0.898531 -0.237626 -0.236688 0.252560 0.251942 0.247063 0.228858 0.252659 0.252539 0.225158 0.295670 0.286720 0.229248 0.229131
chargesum: 0.00000
title: Mulliken charges with hydrogens summed into heavy atoms:
elementType: Br C C C C C C C C C C C C C C C C C
charge: -0.053809 -0.505231 0.295960 0.273169 0.248853 0.248068 0.417046 0.447897 -0.191735 -0.174175 -0.153144 -0.163690 -0.178108 -0.179841 0.000817 -0.316141 -0.008379 -0.007557
polarizability: 3.52725561e+02 1.15056521e+01 2.17720325e+02 1.39002531e+01 -5.50528667e+00 9.75703952e+01
1716.lowfreq: -6.5689 -3.4391 -0.0006 -0.0006 -0.0002 5.1413 36.7935 42.6434 101.2524
frequency: 36.7537 42.5733 101.2513 119.3817 160.6255 184.4166 191.6845 276.1321 280.7990 330.0080 360.9602 431.2028 437.3544 454.0838 462.6542 516.3984 536.8444 544.0137 553.5334 581.6530 589.1685 647.0661 657.4301 690.0734 718.2193 755.4066 772.1460 784.3041 794.7465 833.4758 847.7945 856.5144 874.2056 890.0228 923.3103 929.0802 953.9630 963.7986 984.8245 986.7959 1009.6424 1020.9840 1048.5863 1081.9316 1087.1812 1123.0392 1156.7132 1169.7011 1176.9333 1202.9233 1209.5152 1233.0348 1250.9698 1287.1670 1295.1392 1346.7288 1383.6970 1399.8834 1410.9536 1436.9901 1443.4093 1463.1096 1468.4667 1477.6932 1496.1251 1581.9396 1609.7477 1614.7238 1617.8867 1622.5710 3071.4899 3123.6126 3125.0133 3129.2658 3132.9189 3143.3287 3144.9547 3149.1652 3153.8692 3161.1539 3163.7727
redmass: 8.0534 8.3364 7.9432 4.0920 4.6800 4.3685 4.1606 4.1540 3.0665 4.8999 5.4466 4.4888 3.5266 6.0644 3.1397 4.2342 4.3919 5.6321 6.1508 4.6156 5.5149 3.1112 6.2741 3.8047 5.3353 1.4221 1.9183 5.1263 2.0131 4.5866 3.9128 1.5205 1.5556 1.5414 1.4750 5.0179 1.4436 1.4561 1.3739 1.3424 4.1587 2.2251 1.8550 2.7474 1.7908 1.3018 1.7180 1.2191 1.2613 1.1530 1.6823 2.2312 2.0210 2.1208 1.6338 2.8299 3.3031 4.1433 2.6048 3.0154 3.0446 1.1995 4.3027 3.9142 4.1194 6.4164 7.1841 8.2064 7.5647 7.1935 1.0575 1.0881 1.0856 1.0863 1.0898 1.0922 1.0945 1.0957 1.1101 1.0984 1.1002
irintensity: 0.3354 0.8675 1.7831 1.0342 5.5404 1.1970 2.1801 1.8818 0.5305 3.4838 15.7623 8.9395 3.3794 23.6805 2.0589 14.2922 36.9789 6.3618 0.3734 20.6022 4.4368 3.3694 0.3672 3.6709 17.7682 22.1526 80.9520 4.3718 57.5744 6.2385 7.1366 21.5374 8.3258 1.3078 0.9678 6.9672 3.0610 0.1215 0.5542 0.0640 9.4245 3.2733 0.4366 13.2585 2.1239 5.2781 11.5211 1.9506 3.1265 74.7523 5.2983 0.8844 26.2051 10.8001 0.2734 1.4796 2.8290 2.2359 1.5103 13.3955 21.8052 10.9580 21.3833 20.5087 17.3293 0.4187 10.8677 13.0288 0.9097 3.0250 17.6541 15.0817 1.6241 3.6051 1.2140 5.2742 24.2194 21.9349 2.1018 33.0715 40.2320
temp: 298.150 k
press: 1.00000 atm
elementType: 35 6 6 6 6 6 6 6 6 6 6 6 6 6 6 6 6 6 1 1 1 1 1 1 1 1 1 1 1
symmnumber: 1
zpe: 581867.2 jmol-1
zpe.correction: 0.221622 hartree
zpe.thermalcorrener: 0.235014 hartree
zpe.thermalcorrenthalpy: 0.235958 hartree
zpe.thermalcorrgfe: 0.179996 hartree
zpe.sumelectzpe: -666.703948 hartree
zpe.sumelectthermal: -666.690556 hartree
zpe.sumelectthermalent: -666.689612 hartree
zpe.sumelectthermalfe: -666.745574 hartree
dipole: -2.2893 -0.0736 1.6909
dipole: 2.8470
quadrupole: -110.2705 -95.9244 -118.0678
quadrupole: -0.1280 9.3954 -1.7559
quadrupole: -2.1830 12.1632 -9.9803 -0.1280 9.3954 -1.7559
hfenergy: -666.9255697 hartree
pointgroup: C01 [X(C17H11Br1)]
dipole: -0.8285103 -0.0052687 0.753773 debye
polarizability: 353.434478|6.6871008|217.2081692|-12.5031989|-5.9251812|97.3736339 unknown
InChI: InChI=1S/C17H11Br/c18-10-11-8-9-16-14-5-2-1-4-13(14)15-7-3-6-12(11)17(15)16/h1-9H,10H2
charge 0 multiplicity 1
29 atoms
Br 5.008748 -0.378947 -1.343274
C  0.331774 0.213735 0.117957
C  -0.293991 -1.07742 0.118791
C  -0.644818 1.257386 0.010109
C  -1.752073 -0.838247 0.005476
C  -1.967338 0.587664 -0.060181
C  1.728274 0.431977 0.210946
C  2.559626 -0.751054 0.323542
C  0.524007 -2.207955 0.216007
C  -0.202186 2.58307 -0.010481
C  2.158132 1.804442 0.179446
C  1.940567 -2.020581 0.316058
C  -2.842473 -1.726237 -0.04182
C  -3.270209 1.105015 -0.172885
C  1.210304 2.835451 0.072728
C  4.039788 -0.655967 0.477315
C  -4.153198 -1.19607 -0.15474
C  -4.364322 0.20301 -0.219726
H  0.114726 -3.223706 0.220643
H  -0.896495 3.426439 -0.09243
H  3.22397 2.053687 0.215272
H  2.579711 -2.909236 0.389115
H  -2.690502 -2.810148 0.006542
H  -3.445981 2.185121 -0.224804
H  1.557492 3.87454 0.045596
H  4.495492 -1.580916 0.85542
H  4.378333 0.213239 1.058058
H  -5.012006 -1.875141 -0.192697
H  -5.38465 0.59225 -0.307485
