program: Gaussian 09
title: 000154456
version: EM64L-G09RevD.01
frameworkgroup: C1[X(C20H11NO2)]
method: RPBEPBE
basis: SDD
operation: Freq
keyword: #p
keyword: freq=noraman
keyword: PBEPBE/SDD
title: #p freq=noraman PBEPBE/SDD
converged: NO YES NO NO
title: Mulliken charges:
elementType: O O N C C C C C C C C C C C C C C C C C C C C H H H H H H H H H H H
charge: -0.208619 -0.215418 0.014947 -0.003762 -0.130938 0.292998 0.296884 0.179605 0.248506 0.324901 0.557252 0.213545 -0.757623 -0.419940 -0.391564 -0.413659 -0.475486 -0.373731 -0.383253 -0.274597 -0.280663 -0.275655 -0.276817 0.294864 0.235590 0.236888 0.308511 0.260347 0.233815 0.233540 0.237488 0.239775 0.235918 0.236352
chargesum: 0.00000
title: Mulliken charges with hydrogens summed into heavy atoms:
elementType: O O N C C C C C C C C C C C C C C C C C C C C
charge: -0.208619 -0.215418 0.014947 -0.003762 -0.130938 0.292998 0.296884 0.179605 0.248506 0.324901 0.557252 0.213545 -0.462759 -0.184350 -0.154676 -0.105148 -0.215139 -0.139916 -0.149713 -0.037109 -0.040888 -0.039738 -0.040464
polarizability: 3.77275174e+02 -9.35825190e+00 3.17785021e+02 -3.47976031e-02 1.79283853e-02 8.30041123e+01
1716.lowfreq: -32.2115 -10.1750 -0.0010 -0.0007 -0.0002 4.4034 10.1863 34.5612 81.0034
frequency: -32.2053 34.5376 81.0034 101.2467 128.3345 167.8262 193.5275 259.0254 269.1244 281.0225 286.1872 309.6247 351.3861 371.0973 409.9893 427.0122 432.8305 438.4051 450.0677 496.4661 528.5665 556.1772 569.2923 594.1295 596.6917 604.8648 624.6162 644.6590 652.6209 699.1164 715.8200 727.8495 753.8236 766.2023 768.9962 770.1305 786.9225 813.9208 825.0911 855.5316 907.6679 912.8278 927.5522 944.7109 959.2360 971.0697 972.8655 986.6261 992.0842 994.9329 1004.1058 1045.5910 1076.9908 1082.5613 1097.8430 1115.7265 1157.2998 1181.5407 1184.6330 1192.2097 1207.2440 1229.9747 1252.7234 1271.5391 1286.2806 1302.0247 1326.1004 1349.8840 1371.3104 1385.2762 1396.1333 1405.5632 1410.6417 1433.6990 1438.3797 1473.4228 1481.0725 1496.9501 1524.8850 1571.5628 1588.8905 1593.7463 1604.9844 1617.7493 1620.3394 3133.7687 3137.0226 3143.0839 3147.8151 3154.4229 3161.9482 3168.9288 3169.4796 3175.3035 3179.6020 3221.6064
redmass: 14.5100 6.5095 4.0131 5.1022 4.9290 3.7382 8.5880 3.8513 5.4398 10.8305 4.5525 5.7645 5.4676 9.2241 7.4336 3.1878 7.7546 4.3338 6.7607 3.4920 4.0903 5.7806 3.0034 3.8313 7.4574 7.5295 6.4082 4.4548 6.5948 6.0814 7.5146 2.1458 6.5843 2.4687 5.9527 1.3458 1.6557 7.4837 2.0941 1.6262 1.5037 7.3110 1.8039 2.2635 1.4015 1.4834 6.7727 7.3258 1.4396 1.3832 1.3577 2.8079 2.4891 3.1338 2.3056 1.6703 1.4026 1.5847 2.5902 1.5190 1.2376 1.6577 2.0677 1.6655 2.2902 3.3483 2.2642 6.3113 7.1989 5.6878 2.4932 6.9549 2.6414 4.7095 2.3541 3.7477 2.9289 3.4473 4.9369 4.7388 6.7577 6.6557 6.3036 6.2244 7.7571 1.0853 1.0871 1.0883 1.0904 1.0923 1.0955 1.0943 1.0963 1.0943 1.0942 1.0932
irintensity: 0.0292 0.9692 0.1716 0.7663 4.1168 0.1300 1.3810 1.9015 0.9664 0.0325 2.1880 2.2513 1.2604 1.7866 0.0516 1.1908 0.4311 0.0133 1.5374 0.0067 0.0963 0.2896 0.0105 11.3685 10.7867 4.9742 1.8812 0.0235 0.2828 1.0888 8.0992 14.4001 7.0484 0.2130 0.0585 148.7267 0.1705 12.3593 55.1711 0.7904 3.8506 11.6588 0.0462 1.1123 2.2824 19.5802 13.1335 1.5616 3.8794 4.6513 2.0809 3.9944 5.3299 0.1545 0.0404 19.7722 45.8811 174.6381 308.6479 29.0129 2.4069 11.4622 4.5810 9.7332 7.6918 3.4657 8.7301 97.4256 15.9405 1.1019 12.7922 0.8241 9.0173 1.8015 49.3453 1.7688 12.8469 5.7515 7.2622 2.8219 10.9593 2.2521 14.6389 3.7287 30.6356 0.0508 1.5608 16.4261 19.2233 4.4322 1.4742 7.2316 1.7936 48.7422 28.9968 12.0907
temp: 298.150 k
press: 1.00000 atm
elementType: 8 8 7 6 6 6 6 6 6 6 6 6 6 6 6 6 6 6 6 6 6 6 6 1 1 1 1 1 1 1 1 1 1 1
symmnumber: 1
zpe: 660848.1 jmol-1
zpe.correction: 0.251704 hartree
zpe.thermalcorrener: 0.266631 hartree
zpe.thermalcorrenthalpy: 0.267575 hartree
zpe.thermalcorrgfe: 0.209819 hartree
zpe.sumelectzpe: -972.389336 hartree
zpe.sumelectthermal: -972.374409 hartree
zpe.sumelectthermalent: -972.373465 hartree
zpe.sumelectthermalfe: -972.431220 hartree
dipole: -6.4529 1.2251 0.0059
dipole: 6.5681
quadrupole: -144.6651 -107.9750 -137.1987
quadrupole: 3.4616 0.0319 -0.0042
quadrupole: -14.7188 21.9712 -7.2525 3.4616 0.0319 -0.0042
hfenergy: -972.6410396 hartree
pointgroup: C01 [X(C20H11N1O2)]
dipole: -2.5423225 -0.4628202 -0.0023357 debye
polarizability: 377.4129281|8.9085855|317.647267|0.0349318|0.0176655|83.0041123 unknown
InChI: InChI=1S/C20H11NO2/c22-21(23)18-11-12-5-3-8-15-13-6-1-2-7-14(13)16-9-4-10-17(18)20(16)19(12)15/h1-11H
charge 0 multiplicity 1
34 atoms
O  5.035673 -0.789866 0.001778
O  4.624812 1.437345 0.002967
N  4.214345 0.211454 -0.000412
C  0.332492 0.49141 -0.000246
C  0.014854 -0.92173 -0.000259
C  -0.742324 1.454938 -0.000189
C  -1.347519 -1.38657 -0.000213
C  -2.144996 0.995015 -0.000142
C  -2.447062 -0.408271 -0.000147
C  1.716528 0.947229 -0.000275
C  1.085582 -1.888598 -0.000322
C  2.751834 -0.084179 -0.000397
C  2.441428 -1.434642 -0.000358
C  -0.418969 2.834424 -0.000183
C  -1.583044 -2.786678 -0.00022
C  1.978687 2.346612 -0.00028
C  0.803278 -3.283414 -0.000321
C  -3.230542 1.923001 -0.00007
C  -3.813291 -0.82068 -0.000088
C  0.918593 3.267515 -0.000235
C  -0.527149 -3.725349 -0.000267
C  -4.565113 1.496779 -0.000014
C  -4.860949 0.109042 -0.000026
H  3.25936 -2.160459 -0.000415
H  -1.20894 3.588585 -0.000142
H  -2.607379 -3.167432 -0.00019
H  3.009379 2.694747 -0.000302
H  1.633979 -3.997198 -0.000358
H  -3.032584 2.997341 -0.000049
H  -4.063507 -1.884632 -0.000091
H  1.141431 4.339538 -0.000227
H  -0.75398 -4.796094 -0.000262
H  -5.375858 2.232862 0.000039
H  -5.900848 -0.233947 0.000017
