program: Gaussian 09
title: 000154455
version: EM64L-G09RevD.01
frameworkgroup: C1[X(C14H26O5)]
method: RPBEPBE
basis: SDD
operation: Freq
keyword: #pfreq=noraman
keyword: PBEPBE/SDD
title: #p freq=noraman PBEPBE/SDD
converged: NO YES NO NO
title: Mulliken charges:
elementType: O O O O O C C C C C C C C C C C C C C H H H H H H H H H H H H H H H H H H H H H H H H H H
charge: -0.273312 -0.475674 -0.245514 -0.414044 -0.244083 -0.053780 -0.416267 -0.415814 -0.387056 -0.322803 -0.031843 -0.721786 -0.721370 -0.520729 -0.354743 0.260513 -0.377072 -0.472784 0.189375 0.205471 0.244533 0.198429 0.212445 0.206701 0.192074 0.196545 0.219059 0.241203 0.202804 0.257787 0.210036 0.205279 0.239904 0.197671 0.220012 0.235261 0.235301 0.199355 0.220249 0.211409 0.244381 0.334787 0.248172 0.243544 0.376373
chargesum: 0.00000
title: Mulliken charges with hydrogens summed into heavy atoms:
elementType: O O O O O C C C C C C C C C C C C C C
charge: -0.273312 -0.140888 -0.245514 -0.037671 -0.244083 0.151691 0.026696 0.003332 0.001563 0.137460 0.170961 -0.048683 -0.063783 -0.050168 0.064862 0.260513 0.078718 0.018932 0.189375
polarizability: 1.85810679e+02 1.12549541e+00 1.77466223e+02 -1.56894584e+00 7.47352636e-01 1.40692287e+02
1716.lowfreq: -15.8148 -10.9697 -8.7673 -0.0007 -0.0005 0.0009 9.0232 15.8024 22.8001
frequency: -14.5314 14.9105 22.6259 26.2441 32.0436 42.0867 51.4274 57.6023 77.7572 94.1730 110.4837 117.5521 131.0715 165.3068 185.1987 200.9353 224.4071 234.9967 247.1109 270.8615 282.5161 284.2057 295.5711 316.3215 354.0707 375.9882 420.3219 436.4329 461.7637 468.6451 494.2512 535.4143 542.5847 573.8760 603.0527 627.9768 668.7550 742.1292 746.6575 774.0573 800.1445 816.7778 835.6274 852.3148 858.6905 880.4596 908.0826 914.7709 930.5468 944.2071 986.4932 1001.6307 1018.9949 1033.5296 1036.1084 1055.7929 1057.9962 1072.0547 1074.0262 1078.4127 1103.1908 1120.7277 1133.6890 1137.5359 1171.2818 1186.3664 1196.0737 1203.3017 1211.2139 1246.3539 1248.1145 1250.6877 1257.0780 1274.7542 1284.0527 1289.8339 1294.1830 1301.3181 1322.7831 1327.9550 1335.7275 1349.4918 1352.8853 1356.8723 1370.0260 1371.6245 1382.2217 1387.7215 1396.1744 1441.2575 1443.0231 1445.8021 1460.8538 1466.9441 1469.8185 1471.8614 1473.1562 1478.2215 1479.9478 1484.6745 1501.5074 1632.2246 1657.2278 2960.9121 2963.2460 2966.6426 2973.4409 2975.3930 2977.3352 2980.1369 2981.7200 2990.5285 2991.6695 2996.1596 3002.6210 3015.4232 3035.6380 3036.0090 3055.2901 3058.8641 3063.9223 3067.0112 3068.9272 3070.1665 3079.3660 3082.2630 3092.1961 3503.8328 3562.8506
redmass: 4.2074 5.8439 7.2801 4.8045 4.5168 2.6215 3.8971 5.2901 3.4032 2.8445 2.5915 3.7553 3.2461 2.9974 2.2616 2.2594 1.0925 3.2607 1.7154 2.7760 1.1743 4.2674 1.8826 2.0858 2.4826 3.9887 2.7377 3.0614 2.6801 2.6358 3.0007 2.7690 2.4894 3.6269 2.7080 2.5572 1.5279 1.3462 1.3289 1.7930 1.9636 2.6354 1.8258 3.4378 3.1433 2.3965 1.9294 2.1428 1.5908 2.3490 1.6922 2.2919 2.0102 2.8777 1.7860 2.2284 2.4358 2.1365 1.7491 1.9595 2.5339 2.0424 2.0771 1.5312 2.3869 1.3492 1.4692 1.1886 1.9151 1.3220 1.4368 1.2250 1.3270 1.2654 1.2112 1.1708 1.1320 1.3456 1.2810 1.3262 1.3870 1.4815 1.5460 1.4696 1.6519 1.4846 1.6781 1.2437 1.2067 1.0894 1.0797 1.0845 1.0739 1.0754 1.0713 1.0751 1.0527 1.0463 1.0923 1.0815 1.0560 10.6034 8.2259 1.0818 1.0774 1.0624 1.0388 1.0375 1.0656 1.0614 1.0598 1.0671 1.0630 1.0635 1.0575 1.0998 1.0963 1.0968 1.0987 1.1009 1.0971 1.1014 1.1040 1.0967 1.0990 1.1005 1.0998 1.0638 1.0661
irintensity: 0.7252 1.3218 1.0513 0.4831 0.2135 0.3608 0.7993 1.3197 1.9388 2.6338 0.3405 0.4030 0.9542 0.8986 1.7405 4.8326 0.6066 6.3671 2.2432 3.4077 99.3285 5.4381 33.0696 3.3063 1.9443 10.8096 15.7156 9.2118 2.1316 0.1461 11.6450 10.6851 22.9021 5.0800 35.2311 1.9028 105.8922 15.0479 12.0168 8.1563 16.0829 11.6097 8.0573 5.9825 13.5125 5.2174 18.6668 15.5165 2.1285 69.5256 23.2225 54.2869 2.7809 152.0918 41.6692 22.4723 42.1418 100.2823 59.8063 1.6705 70.3380 10.7706 7.4614 56.1381 0.4629 1.1021 59.3314 2.1180 134.6831 2.4730 9.5123 20.2698 27.7183 0.8303 3.3463 14.5376 4.0142 24.0680 4.9902 0.1824 0.8775 7.4793 13.6992 11.0127 16.7188 2.4476 13.0674 28.9876 14.8775 17.6507 14.9023 2.8952 3.3124 5.3328 15.6868 6.8991 8.1946 4.0817 14.3795 25.7988 8.0059 198.1815 256.5027 41.3936 15.8166 33.8053 28.3890 32.8285 3.7036 18.4297 20.5751 36.5368 33.8149 35.5147 32.6898 38.5692 5.9054 11.7705 9.1568 58.3688 44.7206 32.3384 48.6596 17.8282 60.5249 33.0940 39.2200 22.2006 4.4332
temp: 298.150 k
press: 1.00000 atm
elementType: 8 8 8 8 8 6 6 6 6 6 6 6 6 6 6 6 6 6 6 1 1 1 1 1 1 1 1 1 1 1 1 1 1 1 1 1 1 1 1 1 1 1 1 1 1
symmnumber: 1
zpe: 1009584.6 jmol-1
zpe.correction: 0.384530 hartree
zpe.thermalcorrener: 0.407137 hartree
zpe.thermalcorrenthalpy: 0.408081 hartree
zpe.thermalcorrgfe: 0.328817 hartree
zpe.sumelectzpe: -923.674010 hartree
zpe.sumelectthermal: -923.651403 hartree
zpe.sumelectthermalent: -923.650459 hartree
zpe.sumelectthermalfe: -923.729724 hartree
dipole: 2.5097 -1.3837 -2.2661
dipole: 3.6536
quadrupole: -110.1362 -110.0898 -123.2119
quadrupole: -3.9403 -1.4180 -8.3630
quadrupole: 4.3431 4.3895 -8.7326 -3.9403 -1.4180 -8.3630
hfenergy: -924.0585401 hartree
pointgroup: C01 [X(C14H26O5)]
dipole: -0.8669211 -0.5069257 1.0284178 debye
polarizability: 183.8712488|-1.4909798|177.6607139|-8.8289398|1.0214667|142.4372254 unknown
InChI: InChI=1S/C14H26O5/c1-3-12(9-8-11(2)15)10-19-14(18)7-5-4-6-13(16)17/h11-12,15-16H,3-10H2,1-2H3
charge 0 multiplicity 1
45 atoms
O  0.812434 2.115852 0.247241
O  1.884757 -3.585203 -0.033796
O  0.119756 3.27664 -1.649884
O  -4.347687 -2.038277 1.376747
O  -2.562026 -1.935819 -0.098305
C  2.698543 0.546032 0.332464
C  1.76282 -0.681197 0.507595
C  1.32585 -1.379083 -0.802255
C  4.067151 0.198482 -0.324958
C  2.043735 1.672932 -0.479656
C  0.742915 -2.77769 -0.54451
C  4.844615 -0.920936 0.400963
C  0.131079 -3.415562 -1.801624
C  -1.279721 3.314986 0.385592
C  -1.82082 2.207163 1.319747
C  -0.079775 2.916757 -0.466166
C  -2.332702 0.968138 0.553381
C  -2.931347 -0.08732 1.510672
C  -3.221246 -1.408213 0.826567
H  2.909024 0.945069 1.347718
H  2.273511 -1.428989 1.140559
H  0.860017 -0.35671 1.062381
H  2.187937 -1.502928 -1.486262
H  0.563287 -0.77738 -1.333653
H  4.688117 1.117848 -0.349925
H  3.911632 -0.095283 -1.383067
H  2.710897 2.550021 -0.576068
H  1.752427 1.349362 -1.495475
H  -0.038275 -2.709312 0.243022
H  4.313803 -1.887422 0.339985
H  5.845188 -1.056107 -0.049669
H  4.986888 -0.676346 1.471047
H  -0.73651 -2.823397 -2.142542
H  -0.231638 -4.441841 -1.596259
H  0.877266 -3.468057 -2.615451
H  -0.971816 4.189435 0.993506
H  -2.061101 3.667351 -0.310746
H  -2.641617 2.637261 1.928459
H  -1.020377 1.901277 2.01932
H  -3.098711 1.270979 -0.187606
H  -1.50294 0.508527 -0.014037
H  1.576913 -4.516194 0.105789
H  -3.852964 0.2751 1.997371
H  -2.204721 -0.298393 2.323012
H  -4.486067 -2.915751 0.925078
