program: Gaussian 09
title: 000154452
version: EM64L-G09RevD.01
frameworkgroup: C1[X(C20H10N2O4)]
method: RPBEPBE
basis: SDD
operation: Freq
keyword: #p
keyword: freq=noraman
keyword: PBEPBE/SDD
title: #p freq=noraman PBEPBE/SDD
converged: NO YES NO NO
title: Mulliken charges:
elementType: O O O O N N C C C C C C C C C C C C C C C C C C C C H H H H H H H H H H
charge: -0.154363 -0.154444 -0.162997 -0.162944 -0.065727 -0.032920 -0.010514 -0.116506 0.167924 0.237080 0.309366 0.294272 0.213137 0.470461 0.278029 0.269880 -0.432415 -0.475204 -0.385803 -0.519168 -0.463483 -0.368837 -0.384057 -0.274970 -0.290757 -0.279978 0.261670 0.248799 0.235719 0.279078 0.250170 0.263176 0.234228 0.238832 0.242354 0.240916
chargesum: 0.00000
title: Mulliken charges with hydrogens summed into heavy atoms:
elementType: O O O O N N C C C C C C C C C C C C C C C C C C C C
charge: -0.154363 -0.154444 -0.162997 -0.162944 -0.065727 -0.032920 -0.010514 -0.116506 0.167924 0.237080 0.309366 0.294272 0.213137 0.470461 0.278029 0.269880 -0.170745 -0.226405 -0.150084 -0.240090 -0.213313 -0.105662 -0.149830 -0.036138 -0.048403 -0.039063
polarizability: 3.52982483e+02 -9.76548157e-02 3.39617137e+02 -9.33248598e-03 -1.73241196e-02 1.20602624e+02
1716.lowfreq: -73.9219 -53.2751 -7.5234 -0.0010 -0.0008 -0.0006 8.4908 8.9159 42.8642
frequency: -73.9193 -53.2543 42.8210 46.7234 69.9716 90.5134 124.7324 138.2233 149.4575 178.5185 222.7373 233.2076 273.4478 273.5542 278.0084 299.8831 362.3682 362.8317 396.1539 403.0404 422.1321 424.4271 478.3475 503.7650 516.9779 526.7086 552.3146 554.1827 602.5537 615.7882 625.9938 631.4300 633.6667 678.7008 682.0558 694.2568 696.6520 724.9409 740.4983 743.1237 763.1872 773.2603 779.5236 806.9741 814.1644 847.0997 856.4315 872.1203 876.2224 906.4023 919.5103 938.2744 947.7620 976.2321 991.2780 996.3823 1047.1783 1053.3835 1077.8189 1085.1856 1112.6987 1165.4762 1181.6658 1199.1741 1211.7294 1221.1728 1229.3865 1245.7531 1248.4725 1274.0285 1281.4980 1310.0932 1317.3614 1356.9113 1372.9638 1378.6070 1379.4692 1384.5412 1403.4830 1408.6684 1426.6222 1428.5226 1470.0828 1479.8532 1503.0190 1520.7378 1561.7988 1579.5668 1595.0279 1607.5053 1617.3497 1634.1251 3135.1716 3139.6301 3141.0904 3152.2797 3160.2498 3165.5198 3170.3244 3172.4015 3180.0742 3266.6815
redmass: 13.8072 7.3705 5.6420 8.0107 5.0339 7.5956 12.1670 5.5142 11.8645 4.7975 6.0907 7.2440 9.2612 4.4915 4.5160 6.9429 7.5879 5.6493 6.7954 5.0490 6.7375 3.0743 8.1175 4.1024 5.6191 3.6065 5.9429 4.1620 8.9200 4.4796 3.9976 8.2945 8.5228 9.8789 6.1167 3.6941 8.4496 11.4590 7.2044 1.7576 1.6478 2.4735 6.7579 1.7660 7.5168 1.6280 7.4546 2.1439 1.6209 8.4607 1.4963 6.1708 1.4150 1.3623 1.4024 1.3661 6.9234 3.4684 3.2981 2.3882 2.1111 1.3668 1.4509 1.2002 1.5713 3.5435 2.2511 3.4113 2.2275 2.6211 3.0822 4.3805 2.0411 4.7706 14.3455 14.4819 4.8857 3.2998 4.9862 3.9349 3.9304 2.1602 3.0213 2.9269 3.4023 4.6618 6.3375 6.1213 7.5256 6.5289 5.7760 6.9683 1.0873 1.0876 1.0866 1.0924 1.0934 1.0980 1.0995 1.0937 1.0938 1.0893
irintensity: 0.0072 0.3665 0.1060 0.0194 0.0398 0.1596 3.8457 4.4933 2.0115 0.8164 1.9009 1.3360 2.4865 1.5360 0.0101 1.3131 2.5846 0.4377 3.7927 0.0676 4.7944 1.2702 8.4371 1.3277 1.4774 0.2927 0.8396 5.0914 3.6161 7.2447 7.7021 13.5366 4.6071 2.0107 2.1804 1.5253 13.3489 43.9934 3.1655 33.0215 14.3301 37.1380 1.3636 2.8938 5.7124 66.5606 1.9771 14.8573 9.7891 0.7970 0.9230 2.3062 0.2908 1.8763 0.6886 2.4197 1.8852 3.9486 1.1157 1.7246 10.9522 5.5934 10.4593 1.8581 21.5383 27.4030 8.9753 88.2185 29.8035 43.1370 39.0515 4.7397 6.2100 3.3903 63.8139 257.4769 5.4855 3.7126 5.6074 7.7443 1.0176 19.1165 2.9074 8.1455 3.8332 3.3341 1.7238 4.9321 4.4674 6.8114 2.9455 2.4856 1.0764 2.7494 3.7390 22.0964 3.4892 9.4100 15.7063 2.1345 35.3058 2.5961
temp: 298.150 k
press: 1.00000 atm
elementType: 8 8 8 8 7 7 6 6 6 6 6 6 6 6 6 6 6 6 6 6 6 6 6 6 6 6 1 1 1 1 1 1 1 1 1 1
symmnumber: 1
zpe: 658627.3 jmol-1
zpe.correction: 0.250858 hartree
zpe.thermalcorrener: 0.268379 hartree
zpe.thermalcorrenthalpy: 0.269323 hartree
zpe.thermalcorrgfe: 0.205439 hartree
zpe.sumelectzpe: -1176.662836 hartree
zpe.sumelectthermal: -1176.645315 hartree
zpe.sumelectthermalent: -1176.644371 hartree
zpe.sumelectthermalfe: -1176.708255 hartree
dipole: -5.5535 4.3473 -0.0009
dipole: 7.0527
quadrupole: -143.9765 -136.9218 -160.6920
quadrupole: -0.6647 0.0023 0.0170
quadrupole: 3.2203 10.2749 -13.4952 -0.6647 0.0023 0.0170
hfenergy: -1176.9136936 hartree
pointgroup: C01 [X(C20H10N2O4)]
dipole: -2.2096624 -1.678258 0.0003535 debye
polarizability: 352.9824844|-0.0975894|339.6171362|0.0090784|-0.0174586|120.6026245 unknown
InChI: InChI=1S/C20H10N2O4/c23-21(24)16-10-17(22(25)26)19-14-6-2-1-5-12(14)13-7-3-4-11-8-9-15(16)20(19)18(11)13/h1-10H
charge 0 multiplicity 1
36 atoms
O  0.675719 3.895442 -1.144232
O  0.677149 3.896693 1.141878
O  4.742304 -0.267017 1.144389
O  4.743491 -0.262179 -1.143725
N  0.729266 3.303411 -0.00089
N  4.16537 -0.132704 0.00031
C  0.358085 -0.529554 0.000135
C  -0.606953 -1.610671 -0.000009
C  -0.084001 0.856169 0.000021
C  -2.018131 -1.338439 -0.000251
C  -1.537378 1.14769 0.000145
C  1.765045 -0.8738 0.000296
C  -2.48096 0.057372 -0.000097
C  -0.152259 -2.983151 0.000015
C  0.957081 1.829544 -0.000243
C  2.711292 0.182381 0.000217
C  2.190271 -2.253754 0.000418
C  1.260933 -3.270227 0.000261
C  -2.922413 -2.431908 -0.000521
C  2.332214 1.520428 -0.000137
C  -1.094959 -4.046346 -0.000256
C  -2.065304 2.477607 0.000595
C  -3.877515 0.345986 -0.000111
C  -2.470969 -3.768723 -0.000552
C  -3.442999 2.733942 0.000638
C  -4.36355 1.657947 0.000216
H  3.259443 -2.484518 0.000634
H  1.581458 -4.317684 0.000307
H  -4.000513 -2.256096 -0.000736
H  3.076464 2.32109 -0.000395
H  -0.733274 -5.080374 -0.000253
H  -1.421125 3.350497 0.001079
H  -4.60115 -0.472412 -0.000304
H  -3.199273 -4.58595 -0.000776
H  -3.798436 3.769061 0.001005
H  -5.441829 1.847148 0.000228
