program: Gaussian 09
title: 000154447
version: EM64L-G09RevD.01
frameworkgroup: C1[X(C17H26N2O4)]
method: RPBEPBE
basis: SDD
operation: Freq
keyword: #p
keyword: freq=noraman
keyword: PBEPBE/SDD
title: #p freq=noraman PBEPBE/SDD
converged: YES YES NO NO
title: Mulliken charges:
elementType: O O O O N N C C C C C C C C C C C C C C C C C H H H H H H H H H H H H H H H H H H H H H H H H H H
charge: -0.301618 -0.253260 -0.226577 -0.207773 -0.123484 0.001506 -0.024176 -0.412222 -0.423414 -0.362281 -0.324706 -0.356596 -0.715639 -0.696861 0.186251 0.250140 0.353300 -0.491129 0.232113 -0.370768 -0.313023 -0.665938 -0.656189 0.210508 0.192891 0.212354 0.214860 0.200191 0.186082 0.197546 0.235022 0.229015 0.194627 0.197015 0.217009 0.222822 0.226578 0.216714 0.208881 0.209874 0.314111 0.271351 0.246001 0.249774 0.235721 0.251320 0.226676 0.283412 0.251986
chargesum: 0.00000
title: Mulliken charges with hydrogens summed into heavy atoms:
elementType: O O O O N N C C C C C C C C C C C C C C C C C
charge: -0.301618 -0.253260 -0.226577 -0.207773 -0.123484 0.001506 0.186331 -0.006977 -0.008363 0.021346 0.139332 0.035046 -0.049229 -0.061391 0.186251 0.250140 0.353300 -0.177017 0.232113 -0.099417 -0.067022 0.070878 0.105886
polarizability: 3.19256955e+02 -2.81859813e+01 2.40480418e+02 -1.37252425e+01 -2.07064066e+01 1.52384028e+02
1716.lowfreq: -3.3037 0.0006 0.0008 0.0010 3.7331 10.8396 16.2818 21.1267 35.3655
frequency: 15.7644 20.4590 35.2612 44.7442 52.9427 57.6665 68.0603 75.3050 81.1745 108.1876 112.1924 124.7393 140.2223 153.0496 165.2721 174.1983 192.6397 221.1539 224.1452 230.3218 240.8780 250.4527 254.6554 277.2563 286.1755 304.4792 317.7667 346.9427 359.8302 380.4556 410.9958 445.6838 469.8371 475.2033 489.9718 534.1502 550.3764 577.3000 610.5884 642.8114 675.5831 722.0468 723.4283 728.2800 745.6712 750.8448 767.6588 783.7664 821.3030 825.3024 862.6309 886.3893 892.3315 925.0753 934.6904 951.4413 962.3542 983.0209 997.5501 1007.7654 1025.2172 1037.3831 1058.4160 1063.1025 1079.4413 1082.1172 1091.4651 1092.3471 1119.4681 1129.9829 1147.8672 1152.3884 1168.0886 1169.7533 1195.1882 1204.7027 1211.0322 1220.1660 1247.1648 1260.4194 1268.6738 1268.8696 1284.0631 1290.4791 1300.7250 1324.6869 1338.8331 1341.6599 1353.6130 1363.6911 1370.2454 1372.5249 1377.1138 1389.3315 1389.7171 1430.8195 1435.4240 1449.8034 1464.5368 1466.9712 1467.2539 1470.2125 1473.8755 1476.5480 1477.3880 1478.5021 1485.0245 1485.2972 1486.8653 1491.1215 1491.5065 1529.5338 1549.3286 1614.0875 1625.5001 2953.5905 2956.2907 2960.5208 2966.0455 2971.4664 2971.8847 2978.2906 2980.4222 2983.4702 2995.2527 2996.7731 3016.9242 3029.5732 3038.1053 3059.6395 3066.2510 3067.2870 3067.7599 3071.2470 3075.5324 3078.2201 3089.9008 3104.6949 3163.3755 3172.9844 3183.9884
redmass: 4.4835 4.7403 3.5247 3.0992 4.0946 5.1348 1.9113 3.9097 2.7684 3.8433 3.0685 3.3961 3.2614 3.2206 3.6525 1.8504 1.3122 2.5669 1.4444 2.7051 2.4204 2.0039 1.2762 2.3975 4.7578 2.9322 4.8705 4.0101 4.7160 4.7105 3.0613 2.9270 3.7975 3.4380 3.2977 3.8483 3.0228 4.2904 5.4226 7.7736 7.4451 6.0277 5.3532 1.1633 4.1531 2.1042 1.9667 1.4749 2.3023 1.5780 5.3537 1.5249 1.9423 3.1201 1.7337 3.7079 1.4571 1.3399 1.5751 1.9807 1.4219 2.8126 2.3842 1.8074 4.0992 2.4315 1.5304 1.6328 1.3961 1.9897 2.1918 1.6891 1.9030 1.7662 7.5043 1.3727 1.7456 1.3248 3.7920 1.2112 1.3185 1.1701 1.5668 1.0884 1.3003 1.3479 4.9346 1.6797 1.4940 1.5057 1.8057 2.7014 3.6433 1.2203 1.2157 2.2059 1.3923 1.3957 1.0667 1.0709 1.0715 1.0699 1.0651 1.0433 1.1119 1.0726 1.0628 1.0905 1.0610 1.0792 1.1094 3.2583 6.1205 10.4175 7.1591 1.0600 1.0434 1.0704 1.0639 1.0418 1.0551 1.0341 1.0585 1.0485 1.0957 1.0582 1.1012 1.0972 1.1028 1.0901 1.1060 1.1012 1.1007 1.0993 1.0992 1.1000 1.1013 1.1012 1.0872 1.0919 1.0964
irintensity: 2.6526 0.0086 0.5034 0.4740 0.3280 0.3968 0.0235 0.7483 0.1877 2.2941 0.2974 0.1656 0.5440 0.7402 2.2431 0.2780 0.9130 8.1349 1.2002 5.0165 2.8715 1.0719 0.7977 0.0230 6.2308 1.4154 2.6278 2.8049 1.1465 2.4950 7.3106 2.2972 2.0468 3.3458 2.9997 6.9763 7.1819 6.4368 4.6771 10.2158 26.6118 1.0376 9.0323 11.0775 10.5274 5.4447 19.1647 0.8164 2.8749 27.8705 6.1675 1.7499 2.6312 95.3982 10.2556 8.8489 14.0638 5.9112 5.8305 35.7411 0.5625 9.1002 29.0689 53.6007 325.1665 24.3868 5.6801 18.6813 5.8063 12.1119 1.9232 7.3348 2.8059 22.0148 608.4652 0.6838 197.3158 1.4573 152.6591 5.6049 1.2467 0.8686 34.3564 0.9293 11.2558 1.0060 79.7882 30.2233 1.2566 2.8570 3.5927 38.7418 23.3737 13.0906 19.4896 9.3847 8.9863 18.5172 0.9715 2.6194 31.7528 12.2194 8.8551 12.9426 16.2422 2.7930 2.8170 7.2220 26.3670 5.3351 2.8190 154.3629 46.9956 363.4817 187.5939 4.8626 73.6133 7.2187 25.7215 61.4707 19.2742 57.1561 91.2615 12.2690 0.9470 28.4752 0.6531 24.1389 77.7017 25.6432 25.6464 15.0428 98.0408 52.3088 54.8038 59.5091 11.7610 16.1559 2.4644 6.0722 9.8598
temp: 298.150 k
press: 1.00000 atm
elementType: 8 8 8 8 7 7 6 6 6 6 6 6 6 6 6 6 6 6 6 6 6 6 6 1 1 1 1 1 1 1 1 1 1 1 1 1 1 1 1 1 1 1 1 1 1 1 1 1 1
symmnumber: 1
zpe: 1071312.6 jmol-1
zpe.correction: 0.408041 hartree
zpe.thermalcorrener: 0.433624 hartree
zpe.thermalcorrenthalpy: 0.434568 hartree
zpe.thermalcorrgfe: 0.349719 hartree
zpe.sumelectzpe: -1071.943883 hartree
zpe.sumelectthermal: -1071.918300 hartree
zpe.sumelectthermalent: -1071.917356 hartree
zpe.sumelectthermalfe: -1072.002205 hartree
dipole: 1.6374 6.4435 -4.0730
dipole: 7.7968
quadrupole: -129.6449 -141.7503 -141.7252
quadrupole: -26.2588 17.7262 0.0955
quadrupole: 8.0619 -4.0435 -4.0184 -26.2588 17.7262 0.0955
hfenergy: -1072.3519244 hartree
pointgroup: C01 [X(C17H26N2O4)]
dipole: -0.6724576 2.5580358 1.553621 debye
polarizability: 316.368519|30.6465533|243.3171252|-20.3474213|16.8005998|152.4357567 unknown
InChI: InChI=1S/C17H26N2O4/c1-5-7-8-13(6-2)12-23-17(20)14-9-10-15(18(3)4)16(11-14)19(21)22/h9-11,13H,5-8,12H2,1-4H3
charge 0 multiplicity 1
49 atoms
O  -1.500782 -0.835575 0.521407
O  -0.337692 -2.713624 -0.235178
O  5.089828 -0.021493 -1.858947
O  4.51191 -2.126516 -1.191644
N  4.33983 1.827141 0.317109
N  4.350057 -0.84124 -1.172958
C  -3.913368 -0.709862 0.875156
C  -4.161933 0.253234 -0.316447
C  -5.167836 -1.528952 1.301621
C  -5.228635 1.338422 -0.049301
C  -2.74327 -1.660992 0.580593
C  -5.346805 2.361376 -1.203238
C  -5.747966 -2.469122 0.218714
C  -6.428447 3.433165 -0.949181
C  -0.344669 -1.50061 0.095337
C  0.838027 -0.602388 0.091123
C  3.206558 1.056992 0.114603
C  2.067548 -1.108469 -0.3695
C  3.216065 -0.289629 -0.412463
C  0.774214 0.761435 0.500815
C  1.91836 1.560922 0.512651
C  4.223314 3.277442 0.555742
C  5.686651 1.25674 0.489144
H  -3.615918 -0.094355 1.75109
H  -4.450694 -0.332694 -1.21374
H  -3.201422 0.746273 -0.566281
H  -5.955577 -0.823305 1.627076
H  -4.907126 -2.129354 2.197262
H  -4.98111 1.87638 0.890554
H  -6.220109 0.86877 0.112801
H  -2.853671 -2.189754 -0.383584
H  -2.612597 -2.416965 1.378046
H  -4.364067 2.852188 -1.356842
H  -5.573341 1.821489 -2.14546
H  -6.635469 -3.00211 0.605588
H  -6.06299 -1.910478 -0.681344
H  -5.015529 -3.233757 -0.09824
H  -6.493503 4.150408 -1.787928
H  -6.209664 4.007584 -0.029035
H  -7.424707 2.968264 -0.824073
H  2.127843 -2.134341 -0.745089
H  -0.183634 1.16773 0.837082
H  1.840816 2.582439 0.892762
H  5.189104 3.751979 0.318012
H  3.969827 3.513085 1.610076
H  3.460526 3.723891 -0.103795
H  6.213742 1.828917 1.27369
H  6.270918 1.281732 -0.448748
H  5.621993 0.206588 0.820162
