program: Gaussian 09
title: 000154441
version: EM64L-G09RevD.01
frameworkgroup: C1[X(C20H17NO5)]
method: RPBEPBE
basis: SDD
operation: Freq
keyword: #p
keyword: freq=noraman
keyword: PBEPBE/SDD
title: #p freq=noraman PBEPBE/SDD
converged: YES YES NO NO
title: Mulliken charges:
elementType: O O O O O N C C C C C C C C C C C C C C C C C C C C H H H H H H H H H H H H H H H H H
charge: -0.183520 -0.253076 -0.204533 -0.246412 -0.259690 -0.290887 0.053905 0.129354 0.317540 0.311450 0.041058 0.128415 -0.436382 -0.381666 -0.368375 -0.386800 0.157530 -0.234224 -0.226858 -0.245106 -0.235939 -0.243032 -0.243754 -0.498478 0.290604 -0.741122 0.247995 0.256682 0.262601 0.252722 0.358116 0.232412 0.231245 0.228970 0.228485 0.232914 0.229256 0.241998 0.237349 0.239064 0.255933 0.260901 0.253355
chargesum: 0.00000
title: Mulliken charges with hydrogens summed into heavy atoms:
elementType: O O O O O N C C C C C C C C C C C C C C C C C C C C
charge: -0.183520 -0.253076 -0.204533 -0.246412 -0.259690 0.067230 0.053905 0.129354 0.317540 0.311450 0.041058 0.128415 -0.188387 -0.124984 -0.105774 -0.134078 0.157530 -0.001813 0.004387 -0.016136 -0.007455 -0.010118 -0.014498 0.219934 0.290604 0.029067
polarizability: 3.26291571e+02 8.76038214e-01 3.11439962e+02 -2.37852404e+01 7.19714786e+00 1.59929953e+02
1716.lowfreq: -9.5881 -4.8521 -0.0009 0.0002 0.0005 5.0224 15.0421 24.6682 27.1641
frequency: 14.1144 24.5793 27.1154 32.8402 43.8599 49.1320 51.7416 54.2032 69.6832 87.7748 92.1417 108.3272 125.6253 137.0704 179.1740 194.2700 203.8368 227.5708 248.0651 252.6856 257.5044 290.9404 322.4946 358.7369 386.0318 403.3299 407.3463 438.4232 448.0471 465.5975 500.9211 520.1005 551.5011 573.2111 611.3123 614.8233 627.0389 649.3116 661.0281 670.1085 686.2873 698.3580 705.6732 706.9946 724.5817 729.2911 767.8531 775.6414 808.4629 845.0011 848.1115 855.8110 902.7367 915.1284 924.4225 925.5832 965.7503 974.5237 977.3194 987.9186 989.7112 990.6576 995.5178 997.3348 998.6655 1029.5289 1033.5281 1040.8072 1073.7345 1082.5399 1089.2467 1112.0062 1142.2458 1153.6876 1174.0322 1175.0166 1177.5500 1192.5207 1197.6137 1203.4661 1266.2404 1311.9413 1317.0909 1331.8310 1351.3297 1372.0741 1372.8943 1387.5265 1406.4804 1421.9112 1433.0642 1439.6897 1451.3164 1454.4422 1455.0186 1461.9405 1478.4404 1486.0837 1541.5436 1558.5964 1581.9689 1584.0239 1603.4760 1613.2801 1614.3365 1647.2843 3002.0236 3008.8567 3099.6374 3102.0004 3112.5895 3125.9695 3130.8957 3136.8563 3138.3678 3143.4125 3149.8208 3149.8574 3155.7410 3162.7532 3168.7152 3181.3070 3307.4541
redmass: 1.9509 2.3257 4.5794 5.1392 3.5538 3.9514 5.0497 5.0337 4.0384 4.0997 1.2712 3.4442 4.1152 5.3306 5.7861 5.2821 7.6034 4.8699 6.1803 5.4615 5.7723 4.5467 5.5560 4.6660 5.7720 2.8266 2.8694 5.8224 5.8459 8.9436 4.2077 4.1662 4.2701 4.2188 6.6323 6.3875 6.6175 5.8324 5.8708 3.6676 5.9797 1.8311 5.5218 2.0641 5.3335 4.6461 2.2675 2.2685 5.4160 3.5858 1.2505 1.3379 4.3979 2.8491 1.4639 1.4952 7.6842 1.4122 1.4669 4.2549 3.1778 4.1758 1.5053 2.4735 1.5162 2.2550 2.0533 1.5777 4.1944 1.7258 1.8948 1.2626 1.7757 2.8741 1.0575 1.0769 3.2523 1.1241 1.1351 4.6931 5.7850 1.4309 1.9053 1.9137 1.4704 5.8743 5.8314 1.2201 3.5209 1.2677 2.2473 2.4170 1.0503 1.0655 1.0474 1.0569 2.5520 2.6866 7.6493 8.0980 5.9253 6.4222 10.0403 6.0659 6.2787 8.6079 1.0298 1.0363 1.0974 1.1043 1.0889 1.0849 1.0860 1.0888 1.1013 1.0913 1.0941 1.1043 1.0959 1.0990 1.1014 1.0966 1.0768
irintensity: 0.3464 1.3097 0.2790 1.9206 1.8904 0.2925 1.0228 2.4251 0.4629 0.7841 0.5683 0.1146 1.4436 4.5149 8.9058 1.0251 7.5613 0.5206 3.0115 1.0945 4.6275 23.0661 20.5782 4.8865 0.4272 0.0821 0.6275 49.1021 4.4462 0.7840 5.1247 0.6378 43.0444 11.0582 1.3151 0.8193 10.4728 12.2823 16.3151 106.6676 8.8611 43.2419 7.0574 74.3989 16.6213 18.1393 48.4410 27.0741 20.0444 97.5020 0.7210 9.9641 18.2260 52.4874 12.8678 4.5982 49.8508 0.5842 0.9448 3.6828 14.0766 8.2362 0.7445 2.1098 0.8784 4.9025 5.2551 21.1725 236.5431 8.6033 67.2359 0.2385 81.5079 12.4707 0.8633 10.2137 354.6896 1.1464 5.0397 133.4102 95.6518 11.1009 31.1779 20.0489 84.6924 2.4135 0.4475 34.3252 22.9572 33.4562 18.2856 5.2395 14.0456 16.7525 20.2750 19.0057 50.9372 46.4380 39.2878 86.5957 0.6617 36.2738 303.8689 1.0707 9.9645 210.0711 47.8304 2.8619 4.2360 26.9592 9.6440 0.1558 0.0796 6.6697 5.1129 13.8226 33.1328 16.8420 26.1050 26.6698 18.2761 4.9562 49.0466
temp: 298.150 k
press: 1.00000 atm
elementType: 8 8 8 8 8 7 6 6 6 6 6 6 6 6 6 6 6 6 6 6 6 6 6 6 6 6 1 1 1 1 1 1 1 1 1 1 1 1 1 1 1 1 1
symmnumber: 1
zpe: 848012.2 jmol-1
zpe.correction: 0.322991 hartree
zpe.thermalcorrener: 0.347485 hartree
zpe.thermalcorrenthalpy: 0.348429 hartree
zpe.thermalcorrgfe: 0.264107 hartree
zpe.sumelectzpe: -1201.303917 hartree
zpe.sumelectthermal: -1201.279423 hartree
zpe.sumelectthermalent: -1201.278479 hartree
zpe.sumelectthermalfe: -1201.362801 hartree
dipole: 0.8694 -0.9075 1.6335
dipole: 2.0610
quadrupole: -144.5577 -127.2155 -143.4053
quadrupole: 5.8046 4.2230 4.6181
quadrupole: -6.1649 11.1774 -5.0125 5.8046 4.2230 4.6181
hfenergy: -1201.6269081 hartree
pointgroup: C01 [X(C20H17N1O5)]
dipole: 0.3083103 -0.4503482 0.5996831 debye
polarizability: 320.3671083|-0.0183166|310.6805991|-36.6729344|18.2723625|166.6137792 unknown
InChI: InChI=1S/C20H17NO5/c1-13(22)26-21-19-17(15-11-7-4-8-12-15)16(14-9-5-3-6-10-14)18(25-19)20(23)24-2/h3-12,21H,1-2H3
charge 0 multiplicity 1
43 atoms
O  0.895075 1.986286 -0.540363
O  -0.33667 4.299446 -0.348859
O  3.623216 1.02601 -0.125416
O  -2.299725 3.380063 0.521431
O  4.841738 -0.892667 -0.644013
N  2.605347 0.45334 -1.117897
C  0.251749 -0.221545 -0.395608
C  -0.901477 0.608344 -0.071515
C  0.370773 -1.696104 -0.376019
C  -2.265232 0.093895 0.207379
C  -0.46174 1.94291 -0.139138
C  1.309087 0.660744 -0.671755
C  1.037028 -2.382361 -1.429814
C  -0.138296 -2.455288 0.714248
C  -3.046514 0.574124 1.291743
C  -2.805776 -0.924191 -0.627172
C  -1.139275 3.228858 0.055373
C  1.20503 -3.784284 -1.387565
C  0.024169 -3.855022 0.75085
C  -4.329915 0.042134 1.539126
C  -4.093387 -1.445598 -0.385317
C  0.700669 -4.526085 -0.296272
C  -4.860149 -0.967595 0.702914
C  -0.945416 5.636844 -0.166316
C  4.766465 0.20604 -0.046013
C  5.814581 0.856834 0.823028
H  1.379683 -1.826082 -2.312137
H  -0.65143 -1.942261 1.534033
H  -2.654004 1.37033 1.928873
H  -2.218356 -1.297085 -1.472732
H  2.881791 -0.539713 -1.258015
H  1.721788 -4.293278 -2.20834
H  -0.371397 -4.423162 1.599973
H  -4.918868 0.424079 2.380152
H  -4.496867 -2.222213 -1.044326
H  0.828063 -5.613575 -0.262379
H  -5.859587 -1.374179 0.894357
H  -1.859817 5.728528 -0.776611
H  -0.171173 6.339737 -0.503535
H  -1.201898 5.802905 0.893888
H  6.706155 1.07683 0.209671
H  5.442694 1.789538 1.271202
H  6.119667 0.15237 1.615086
