program: Gaussian 09
title: 000154438
version: EM64L-G09RevD.01
frameworkgroup: C1[X(C8H4Cl3NO2S2)]
method: RPBEPBE
basis: SDD
operation: Freq
keyword: #p
keyword: freq=noraman
keyword: PBEPBE/SDD
title: #p freq=noraman PBEPBE/SDD
converged: YES YES NO NO
title: Mulliken charges:
elementType: Cl Cl Cl S S O O N C C C C C C C C H H H H
charge: 0.027445 0.096783 0.081473 0.193451 0.129766 -0.189295 -0.193052 0.018102 0.501070 -0.395172 -0.333969 -0.115801 -0.196530 -0.240602 -0.249714 -0.191320 0.288909 0.274281 0.246268 0.247907
chargesum: 0.00000
title: Mulliken charges with hydrogens summed into heavy atoms:
elementType: Cl Cl Cl S S O O N C C C C C C C C
charge: 0.027445 0.096783 0.081473 0.193451 0.129766 -0.189295 -0.193052 0.018102 0.501070 -0.395172 -0.045060 0.158481 0.051377 0.005665 -0.249714 -0.191320
polarizability: 3.21682164e+02 -6.59118396e+00 1.76048207e+02 1.92380218e+01 4.28566777e+00 1.12090540e+02
1716.lowfreq: -3.9572 -2.2346 -0.0036 -0.0035 -0.0029 2.1200 14.5683 23.3250 28.6063
frequency: 14.5682 23.3008 28.5439 63.5586 85.5059 107.2378 123.2746 170.7729 183.1529 197.1409 219.4626 238.9291 262.6100 295.7385 309.9743 331.0974 350.0721 384.5330 402.2796 425.7307 446.4999 492.2471 502.0678 535.8028 643.5852 653.0495 674.2352 676.5302 717.0781 781.7504 785.4052 794.4637 868.5051 883.3312 978.6939 1002.0071 1020.3326 1032.5690 1103.0139 1122.7174 1178.4251 1195.8006 1259.2934 1346.7420 1391.5577 1428.3136 1442.0279 1532.4214 1565.4573 1594.1122 3146.6405 3160.2670 3169.4542 3184.7139
redmass: 17.8752 13.4086 11.3573 19.9605 21.9435 11.7447 4.7679 15.3233 16.4367 18.5788 7.0783 23.5621 11.2690 17.0333 23.8590 17.8921 15.0285 17.6757 31.6754 3.5045 10.1389 4.0127 12.0984 7.8236 7.5181 5.5924 8.7885 13.3802 3.7137 1.4899 7.2993 10.7472 9.3640 1.3907 1.3542 1.3398 7.4346 2.5555 2.6712 2.4554 1.1467 2.9365 1.5252 10.7086 4.8448 2.7983 2.2786 11.9902 6.7119 6.2397 1.0870 1.0906 1.0944 1.1000
irintensity: 0.6391 0.0264 1.6020 0.0507 0.1052 2.3893 0.6650 5.0113 1.1840 28.9662 0.2926 8.0797 29.8017 2.9079 2.2260 9.4231 19.8010 4.6538 13.4684 1.1848 2.2712 6.6938 4.0987 0.8582 7.6331 10.4256 4.7955 66.2672 16.3854 33.5620 17.4292 165.7349 17.7186 1.8098 1.8128 0.2115 22.4156 9.4151 15.0476 58.2819 9.6176 89.4170 13.3655 378.9792 21.6667 4.2995 108.7721 157.4212 25.6119 35.7848 4.8100 0.9577 9.1538 9.5100
temp: 298.150 k
press: 1.00000 atm
elementType: 17 17 17 16 16 8 8 7 6 6 6 6 6 6 6 6 1 1 1 1
symmnumber: 1
zpe: 278290.8 jmol-1
zpe.correction: 0.105995 hartree
zpe.thermalcorrener: 0.122436 hartree
zpe.thermalcorrenthalpy: 0.123381 hartree
zpe.thermalcorrgfe: 0.057788 hartree
zpe.sumelectzpe: -2687.470228 hartree
zpe.sumelectthermal: -2687.453787 hartree
zpe.sumelectthermalent: -2687.452843 hartree
zpe.sumelectthermalfe: -2687.518436 hartree
dipole: -1.4538 4.2755 1.3362
dipole: 4.7094
quadrupole: -120.7882 -127.2313 -128.4268
quadrupole: -17.4848 -4.0772 -0.9645
quadrupole: 4.6939 -1.7492 -2.9447 -17.4848 -4.0772 -0.9645
hfenergy: -2687.5762231 hartree
pointgroup: C01 [X(C8H4Cl3N1O2S2)]
dipole: -1.0387064 -1.3355448 0.7552389 debye
dipolederiv: -0.1622864 -0.0573254 0.2358855 -0.0581904 -0.0134685 0.0192255 -0.0419334 0.1185395 -0.7198775 -0.5945863 -0.0081339 -0.3175997 -0.1687455 0.0671912 -0.0773622 -0.5966377 0.0015289 -0.5351719 -0.3733486 -0.0313535 0.2043217 -0.0871265 0.0409184 0.039168 0.4452981 0.0026756 -0.5166648 0.156569 -0.355029 0.1675011 -0.9326619 0.7354124 -0.1832742 0.2480335 -0.1786842 0.0227413 -0.0128628 0.0198652 -0.091203 0.1395701 -0.1422282 0.0737021 0.2603253 0.0754876 -0.1654917 -1.0042208 0.6036409 -0.0834368 0.4388608 -0.8053429 0.1382198 0.1042925 0.0168517 -0.2317949 -1.1601006 0.3301193 0.0220469 0.2571218 -0.5680277 0.1829318 0.3137877 0.0222157 -0.2588343 1.4749283 -0.578307 -0.0514244 -0.1191253 1.2780866 -0.3847574 -0.4230418 -0.2330015 0.3651812 -0.1039549 -0.0760866 0.0851399 0.1208624 -0.6362556 0.2521642 0.0305124 0.3314332 -0.0620312 0.7092349 -0.179443 -0.12638 0.5241779 0.0614062 -0.1525099 -0.532063 0.008539 0.0471791 -0.0880585 0.2145085 -0.1071903 -0.084861 0.1577985 -0.0676694 0.0336646 -0.1922232 -0.0256205 -0.436486 -0.1062414 0.1415408 -0.3909939 -0.0547469 0.0899986 0.3161703 0.0299902 -0.1482376 0.0170191 0.0865188 -0.120095 0.177756 -0.3289377 0.0136397 -0.146625 0.0414337 -0.1074264 0.2955385 -0.1186269 -0.0796942 -0.0995198 0.2304022 -0.0952571 -0.1300534 -0.0951845 -0.0238549 -0.4128972 0.1980641 -0.2244332 -0.1724342 -0.1545625 -0.0585807 0.0133797 -0.1858273 0.7934558 1.4280188 0.0038278 0.1984569 0.4064002 -0.0940841 0.0577504 -0.0286886 0.0801822 1.0891217 0.1068982 0.0110918 0.0246022 0.0647579 0.0783963 0.0130438 0.0000146 0.0350202 0.1585775 0.1185297 0.0758353 0.0140346 0.0418414 0.0788934 0.0244484 -0.0073879 0.004176 0.1006055 0.0888539 -0.0105787 0.0235215 -0.0336376 -0.0274524 0.0786499 0.047021 0.0795725 0.1054325 -0.0467883 -0.0223461 0.0844055 -0.0240524 0.0966013 0.0364687 0.0939309 0.0372748 0.1127111 unknown
polarizability: 308.9083933|-48.7084108|162.793389|-7.0847789|-32.0321396|138.1191289 unknown
InChI: InChI=1S/C8H4Cl3NO2S2/c9-7(10)8(11)16-15-6-4-2-1-3-5(6)12(13)14/h1-4H
charge 0 multiplicity 1
20 atoms
Cl 1.870736 -1.339218 2.081835
Cl 5.012089 -0.626268 1.769611
Cl 4.817252 -0.713811 -1.228589
S  0.365524 0.384981 -1.214724
S  1.619041 -1.655172 -0.980689
O  -2.997373 3.083066 -0.962835
O  -0.884183 2.414089 -1.517484
N  -2.065504 2.19821 -0.964514
C  -2.266125 0.898724 -0.3515
C  -1.207525 -0.057759 -0.384391
C  -3.516064 0.631879 0.261275
C  -1.448961 -1.312072 0.230479
C  -3.727712 -0.616669 0.859893
C  -2.68756 -1.584004 0.84076
C  2.642899 -1.241987 0.424985
C  3.965389 -0.903511 0.33966
H  -4.279349 1.41502 0.247372
H  -0.658742 -2.068057 0.229527
H  -2.84306 -2.560997 1.3101
H  -4.685271 -0.842545 1.33793
