program: Gaussian 09
title: 000154435
version: EM64L-G09RevD.01
frameworkgroup: C1[X(C14H11N3O4)]
method: RPBEPBE
basis: SDD
operation: Freq
keyword: #p
keyword: freq=noraman
keyword: PBEPBE/SDD
title: #p freq=noraman PBEPBE/SDD
converged: YES YES NO NO
title: Mulliken charges:
elementType: O O O O N N N C C C C C C C C C C C C C C H H H H H H H H H H H
charge: -0.217991 -0.207628 -0.212602 -0.212950 -0.451319 0.011860 0.018581 0.082340 -0.028901 0.245585 0.197998 0.217353 0.431636 0.232569 -0.573070 -0.487795 -0.343515 -0.784130 -0.791069 0.366081 -0.386034 0.315875 0.293970 0.285113 0.249040 0.264767 0.264719 0.224064 0.253711 0.253767 0.196391 0.291582
chargesum: 0.00000
title: Mulliken charges with hydrogens summed into heavy atoms:
elementType: O O O O N N N C C C C C C C C C C C C C C
charge: -0.217991 -0.207628 -0.212602 -0.212950 -0.135444 0.011860 0.018581 0.082340 -0.028901 0.245585 0.197998 0.217353 0.431636 0.232569 -0.279101 -0.202682 -0.094474 -0.030579 -0.087200 0.366081 -0.094451
polarizability: 3.60673201e+02 4.54049312e-01 2.30452843e+02 -1.25722422e-02 1.09138586e-02 7.87035894e+01
1716.lowfreq: -139.6834 -66.2089 -4.2892 0.0006 0.0007 0.0009 2.5903 9.1041 33.9377
frequency: -139.6804 -66.1721 33.8920 51.9466 67.2913 105.6189 113.5164 156.9051 169.8277 189.3745 210.0245 231.9296 275.4498 314.6783 325.1948 329.2193 355.4640 371.4405 379.6477 431.8507 433.0420 464.4716 516.4087 532.6016 533.8005 559.7182 571.0738 597.4668 615.6607 631.9675 656.1475 694.9117 707.8655 709.5932 725.4241 751.5062 778.3969 787.0891 824.4106 831.6232 858.5439 928.5708 931.2124 941.2982 976.8007 989.7078 1019.9273 1027.6589 1040.9484 1042.0023 1084.2319 1127.8083 1135.6744 1188.5621 1200.0783 1212.3929 1216.9689 1262.7821 1276.5452 1298.3348 1333.7558 1353.5905 1365.5353 1377.8458 1393.6664 1407.0009 1415.3343 1428.6930 1456.2757 1462.4509 1466.2451 1470.0917 1472.7726 1485.5106 1501.7309 1581.8318 1593.9324 1618.7298 1629.3060 2988.8527 3017.2411 3072.9946 3081.2826 3081.7116 3151.6957 3170.8532 3172.0442 3190.3186 3204.1695 3605.1151
redmass: 1.0181 3.0626 6.8307 10.2637 6.2717 10.6067 3.9181 4.2679 3.4928 1.4623 8.7366 3.5418 10.3733 4.3021 5.3365 8.2538 3.2427 5.6916 5.7898 8.5413 2.9979 5.1980 7.9903 3.8904 5.3145 1.1620 5.4117 4.5945 7.2441 3.8718 6.2648 6.2378 8.3609 8.5560 6.2793 5.0945 10.1156 4.9794 4.9446 1.5690 4.8101 1.3367 1.5086 5.6016 1.3284 1.8779 1.6179 1.5517 2.9292 1.5093 2.6081 1.5685 2.9572 9.7978 1.8965 6.1588 2.5295 2.1676 1.8570 3.2317 4.6227 5.7648 8.1285 3.8746 1.6114 1.4238 2.0384 2.7476 1.0442 1.9309 1.0427 3.3424 1.8264 1.4218 5.7495 7.2140 6.6892 6.7908 8.1947 1.0371 1.0427 1.0985 1.0984 1.0954 1.0910 1.0935 1.0913 1.0950 1.0909 1.0800
irintensity: 0.4533 0.0799 1.6703 0.0464 0.0005 1.7922 0.6173 2.4928 0.1866 2.4610 0.6201 0.5171 1.5651 2.6956 0.0542 0.4448 2.2359 1.2294 2.1801 1.4832 6.8047 0.9344 2.0880 2.5607 4.8012 77.5606 0.0228 17.0597 10.8706 13.1357 0.7776 22.7959 0.9568 9.1230 15.8985 1.9639 14.2389 0.9343 6.2242 49.8690 1.3712 6.4395 25.2643 2.0389 0.9124 5.3806 23.0609 4.0823 1.2726 12.4650 70.0037 41.8116 0.1180 628.1524 131.1320 326.9837 120.5351 15.6579 25.3947 2.1509 23.6925 203.7350 179.4083 5.8769 12.8345 17.0180 9.5357 5.3510 10.3777 14.6596 13.6488 10.1207 42.1175 20.1856 15.0187 87.6028 110.4817 19.6300 49.8729 26.7664 2.5253 10.1117 20.5184 3.6627 6.6779 19.1446 5.5638 4.2617 0.7996 73.0046
temp: 298.150 k
press: 1.00000 atm
elementType: 8 8 8 8 7 7 7 6 6 6 6 6 6 6 6 6 6 6 6 6 6 1 1 1 1 1 1 1 1 1 1 1
symmnumber: 1
zpe: 606190.1 jmol-1
zpe.correction: 0.230886 hartree
zpe.thermalcorrener: 0.247090 hartree
zpe.thermalcorrenthalpy: 0.248034 hartree
zpe.thermalcorrgfe: 0.186660 hartree
zpe.sumelectzpe: -1003.642820 hartree
zpe.sumelectthermal: -1003.626616 hartree
zpe.sumelectthermalent: -1003.625672 hartree
zpe.sumelectthermalfe: -1003.687045 hartree
dipole: -0.9400 9.0025 0.0012
dipole: 9.0515
quadrupole: -168.8803 -109.5820 -121.2508
quadrupole: -2.4026 0.0154 0.0003
quadrupole: -35.6426 23.6557 11.9869 -2.4026 0.0154 0.0003
hfenergy: -1003.8737056 hartree
pointgroup: C01 [X(C14H11N3O4)]
dipole: -0.351546 3.5437254 0.0004762 debye
polarizability: 360.6744222|-0.2171935|230.4516221|-0.0125158|0.0109785|78.7035894 unknown
InChI: InChI=1S/C14H11N3O4/c1-7-5-12(17(20)21)8(2)13-10-6-9(16(18)19)3-4-11(10)15-14(7)13/h3-6,15H,1-2H3
charge 0 multiplicity 1
32 atoms
O  -5.151937 -1.185736 0.000506
O  -3.626768 -2.866037 0.000151
O  5.642009 -0.720743 -0.000756
O  4.144839 -2.442218 -0.0009
N  0.072804 2.354285 0.000071
N  -3.926558 -1.607841 -0.000504
N  4.433561 -1.18124 -0.000127
C  -0.541456 0.126042 0.000035
C  -1.024606 1.485639 -0.000081
C  0.930881 0.217351 0.000083
C  1.25988 1.623962 0.000137
C  -1.458443 -0.965798 0.000118
C  -2.396762 1.833853 -0.00027
C  -2.840366 -0.595551 -0.000226
C  -3.289652 0.753722 -0.000401
C  1.998894 -0.706123 -0.000066
C  2.585242 2.110798 0.00019
C  -0.969639 -2.398947 0.000733
C  -2.892422 3.268593 -0.000184
C  3.319763 -0.20854 -0.000006
C  3.631462 1.176536 0.000132
H  0.012121 3.370238 0.00013
H  -4.36961 0.924142 -0.000687
H  1.869281 -1.7885 -0.000282
H  2.795838 3.184739 0.00025
H  -1.35089 -2.951472 0.876255
H  -1.348772 -2.951538 -0.875688
H  0.124132 -2.449035 0.002082
H  -3.519212 3.469637 -0.887496
H  -3.513175 3.471707 0.890929
H  -2.075744 4.011417 -0.003895
H  4.679806 1.484057 0.000168
