program: Gaussian 09
title: 000154431
version: EM64L-G09RevD.01
frameworkgroup: C1[X(C20H13NO2)]
method: RPBEPBE
basis: SDD
operation: Freq
keyword: #p
keyword: freq=noraman
keyword: PBEPBE/SDD
title: #p freq=noraman PBEPBE/SDD
converged: YES YES NO NO
title: Mulliken charges:
elementType: O O N C C C C C C C C C C C C C C C C C C C C H H H H H H H H H H H H H
charge: -0.218760 -0.226936 0.015707 -0.005553 0.359749 0.119883 0.063251 0.499502 -0.532034 0.407389 0.299547 0.492505 -0.778043 -0.466983 -0.474480 -0.458945 -0.493769 -0.392676 -0.493831 0.207187 -0.201700 -0.471151 -0.451465 0.239372 0.224255 0.248597 0.228726 0.221787 0.230498 0.308145 0.248594 0.238005 0.248472 0.226581 0.249965 0.288611
chargesum: 0.00000
title: Mulliken charges with hydrogens summed into heavy atoms:
elementType: O O N C C C C C C C C C C C C C C C C C C C C
charge: -0.218760 -0.226936 0.015707 -0.005553 0.359749 0.119883 0.063251 0.499502 -0.068408 0.407389 0.299547 0.492505 -0.529446 -0.016470 -0.243982 -0.150800 -0.245175 -0.154671 -0.245359 0.207187 0.024881 -0.221186 -0.162854
polarizability: 4.74903917e+02 6.93525805e+00 2.74505082e+02 2.09284366e+00 -3.13731057e-01 9.39685012e+01
1716.lowfreq: -5.2030 -4.1399 -0.0007 -0.0006 -0.0005 6.4068 8.3541 47.4567 65.1398
frequency: 7.9755 47.4401 65.1309 94.8522 124.1000 153.9475 185.4909 220.0759 237.9549 254.3195 293.2253 293.4696 325.1221 344.5673 364.9894 416.5941 421.7361 436.0559 485.8498 491.5701 511.5074 525.8612 537.7033 547.9591 557.5397 574.6422 583.0742 621.3607 641.5275 684.7247 687.2191 702.6398 716.4821 729.6334 739.2989 786.1572 794.9227 816.0251 821.5429 834.3887 843.8178 860.5758 874.6646 889.3844 906.3895 930.6023 975.3160 985.4535 997.6769 1005.0730 1009.1848 1019.1222 1024.1675 1045.8809 1120.5381 1128.1960 1156.9729 1165.0534 1168.9890 1177.9578 1182.9387 1190.5441 1203.1235 1225.8492 1248.7985 1253.2435 1287.7555 1308.7027 1318.5266 1337.0316 1344.8161 1379.7459 1383.9465 1396.4732 1405.6544 1412.9050 1429.1951 1436.9212 1450.4933 1457.9962 1470.9587 1480.1588 1500.1828 1553.6063 1573.7220 1604.7308 1607.8006 1625.4350 1652.1950 2948.7598 2957.3654 3036.7540 3059.8418 3113.0830 3121.3314 3126.5443 3142.7390 3144.0914 3150.4301 3156.6039 3189.7245 3216.0444
redmass: 14.8320 5.4535 4.4587 3.6136 3.2990 6.7006 2.9429 3.9751 4.0868 6.8752 4.0489 7.7338 3.7885 7.0270 5.8969 3.0617 3.5980 5.4345 5.8578 4.6290 3.7563 6.0415 4.6561 3.7478 6.1001 4.2632 6.7045 4.8346 2.9006 6.4844 5.7306 3.9399 2.0217 2.3352 7.5376 2.5103 3.4738 1.6495 3.2835 2.9137 6.5053 1.7452 1.7252 3.5019 2.5200 1.8131 1.2781 1.3936 1.3850 3.6343 1.3297 2.7871 2.7945 3.5487 2.7059 1.9631 2.2600 1.1768 1.1403 2.7566 1.8352 1.6411 1.7336 1.5039 1.2890 1.9511 2.3729 1.4744 3.2511 3.3698 1.7949 2.9546 3.3087 2.2237 4.6171 3.2506 3.4484 3.4506 1.2846 1.0994 3.3475 6.1501 4.2309 5.5900 8.3815 6.4041 6.8809 7.1761 6.8009 1.0710 1.0651 1.0924 1.0904 1.0857 1.0912 1.0866 1.0910 1.0998 1.0982 1.0890 1.0938 1.0932
irintensity: 0.0034 0.4247 2.2316 0.5796 0.1607 1.6041 0.9800 8.5005 1.7671 1.1047 1.7559 0.7929 0.2525 1.0523 0.5215 2.6856 0.6934 1.7103 0.9869 1.3070 0.3105 1.3503 2.9202 0.9422 3.8428 1.5301 0.2248 2.7698 2.3036 13.0818 3.6793 6.8435 21.6529 39.2785 11.9953 11.7475 2.6462 0.9843 6.2622 7.3905 7.9233 34.5484 31.6302 1.3249 8.9177 68.1258 5.0802 1.2900 1.0075 4.4017 2.4530 13.1546 1.7880 10.7718 1.3267 2.2927 64.5898 10.7545 1.8321 416.1969 251.0883 11.8825 135.6415 3.1019 16.6853 4.1514 36.1147 8.1412 6.8147 42.1275 1.6849 7.2424 7.6984 9.8710 45.5855 3.3456 7.9191 8.2604 7.5698 15.9501 1.3741 14.6616 22.5203 3.8069 18.8738 4.0360 89.2488 26.3991 4.8359 19.5242 37.9234 41.8241 17.3358 2.0908 9.7005 2.3887 7.3240 51.6711 32.4270 9.2253 3.8048 9.3612
temp: 298.150 k
press: 1.00000 atm
elementType: 8 8 7 6 6 6 6 6 6 6 6 6 6 6 6 6 6 6 6 6 6 6 6 1 1 1 1 1 1 1 1 1 1 1 1 1
symmnumber: 1
zpe: 718061.2 jmol-1
zpe.correction: 0.273495 hartree
zpe.thermalcorrener: 0.290004 hartree
zpe.thermalcorrenthalpy: 0.290949 hartree
zpe.thermalcorrgfe: 0.227943 hartree
zpe.sumelectzpe: -973.546479 hartree
zpe.sumelectthermal: -973.529970 hartree
zpe.sumelectthermalent: -973.529025 hartree
zpe.sumelectthermalfe: -973.592032 hartree
dipole: -6.8914 3.3649 0.0630
dipole: 7.6693
quadrupole: -139.6063 -119.8073 -136.3243
quadrupole: 21.5536 -0.1672 -0.1486
quadrupole: -7.6937 12.1053 -4.4116 21.5536 -0.1672 -0.1486
hfenergy: -973.8199741 hartree
pointgroup: C01 [X(C20H13N1O2)]
dipole: -2.7108954 -1.3248191 -0.0104969 debye
polarizability: 474.8945982|-6.8862183|274.492256|-3.0728887|-1.2564008|93.9906458 unknown
InChI: InChI=1S/C20H13NO2/c22-21(23)18-10-7-12-5-6-14-11-13-3-1-2-4-15(13)16-8-9-17(18)19(12)20(14)16/h1,3,5-11H,2,4H2
charge 0 multiplicity 1
36 atoms
O  5.478045 1.285765 -0.066683
O  3.765412 2.7722 -0.006379
N  4.208895 1.55371 -0.035869
C  -0.406201 -0.571471 0.030536
C  -1.085742 0.704221 0.067877
C  -2.51331 0.762127 0.099937
C  1.03285 -0.643283 -0.003764
C  -1.186804 -1.784855 0.039404
C  -3.286273 2.072221 0.222163
C  -3.26826 -0.452704 0.107286
C  1.832364 0.570267 0.002868
C  1.669649 -1.940874 -0.04187
C  -2.600036 -1.697455 0.084273
C  -4.680123 2.026584 -0.452028
C  -0.257583 1.886294 0.083533
C  1.125401 1.832807 0.052208
C  -0.516539 -3.062078 0.004536
C  -4.74108 -0.402941 0.139204
C  0.863472 -3.136585 -0.038085
C  3.261009 0.416276 -0.036225
C  -5.424111 0.747825 -0.119546
C  3.089638 -2.021287 -0.079825
C  3.871055 -0.864205 -0.077962
H  -3.423995 2.285394 1.30439
H  -2.714243 2.919842 -0.191221
H  -3.190632 -2.622229 0.09306
H  -4.570327 2.100082 -1.555825
H  -5.266586 2.911464 -0.142615
H  -0.731638 2.871224 0.124491
H  1.708259 2.752053 0.062926
H  -1.124999 -3.973787 0.010267
H  -5.277149 -1.339968 0.334664
H  1.371121 -4.106945 -0.06792
H  -6.520579 0.753454 -0.141945
H  3.570003 -3.005064 -0.109866
H  4.961635 -0.912476 -0.106498
