program: Gaussian 09
title: 000154430
version: EM64L-G09RevD.01
frameworkgroup: C1[X(C22H12O3)]
method: RPBEPBE
basis: SDD
operation: Freq
keyword: #pfreq=noraman
keyword: PBEPBE/SDD
title: #p freq=noraman PBEPBE/SDD
converged: YES YES NO NO
title: Mulliken charges:
elementType: O O O C C C C C C C C C C C C C C C C C C C C C C H H H H H H H H H H H H
charge: -0.251072 -0.436390 -0.484072 0.021474 0.173092 -0.113527 0.178157 0.221930 0.227795 0.108108 0.185414 0.525726 -0.458529 -0.445248 0.466983 -0.506401 -0.494389 0.014040 -0.383428 -0.477970 -0.446549 0.132407 -0.373751 -0.255948 -0.249527 0.228558 0.225862 0.237126 0.232186 0.254397 0.244272 0.241722 0.224690 0.230773 0.229285 0.396249 0.376555
chargesum: 0.00000
title: Mulliken charges with hydrogens summed into heavy atoms:
elementType: O O O C C C C C C C C C C C C C C C C C C C C C C
charge: -0.251072 -0.040141 -0.107517 0.021474 0.173092 -0.113527 0.178157 0.221930 0.227795 0.108108 0.185414 0.525726 -0.229971 -0.219386 0.466983 -0.269275 -0.262203 0.014040 -0.129032 -0.233698 -0.204827 0.132407 -0.149061 -0.025174 -0.020242
polarizability: 5.54700655e+02 1.67503464e+01 2.74786491e+02 1.89790118e-01 -5.02839921e-01 9.13649281e+01
1716.lowfreq: -5.0260 -0.0009 0.0003 0.0006 2.7735 7.4051 24.8240 49.3286 88.3601
frequency: 24.8218 49.3259 88.3597 91.8950 101.3872 137.2498 143.7640 154.3072 194.7490 205.5716 228.4481 239.5290 248.2596 255.8704 288.7763 314.6146 348.4039 349.8128 406.9967 428.1596 452.7078 460.4609 471.2570 488.9457 491.7957 504.9271 511.5628 519.8161 533.1771 562.7023 566.6501 580.7538 599.2566 620.0518 652.2239 669.7935 681.5788 718.3342 719.5627 753.4838 761.2182 773.5258 782.3441 796.0072 815.1548 833.1612 840.2803 857.3840 866.3169 891.2894 893.1193 916.6528 959.2773 968.8118 968.8899 976.5786 993.1557 1022.1227 1030.2585 1078.2488 1102.2792 1128.1828 1152.1302 1156.6181 1174.6407 1191.3878 1215.6548 1226.7063 1238.6048 1244.9572 1255.6045 1272.4614 1291.1011 1291.8908 1315.9466 1346.2939 1385.4222 1404.1332 1416.5869 1430.8990 1432.7773 1452.1793 1469.5659 1490.5894 1514.8700 1535.2456 1537.4104 1560.5540 1598.2196 1602.6956 1622.9806 1634.7465 1855.8360 3123.6833 3124.0895 3126.4901 3129.5819 3130.6946 3145.0168 3153.8874 3157.2398 3163.8098 3170.7712 3522.1045 3628.3085
redmass: 6.8374 5.2774 7.1127 7.1517 6.3027 5.9813 5.5585 11.5632 4.3964 7.7510 3.6216 6.8105 1.9779 1.9417 5.0135 5.0292 6.5687 6.4483 3.2564 7.0679 7.6524 4.6268 5.9848 1.1117 7.6331 4.2650 6.3104 3.8967 6.0441 5.3614 3.9905 4.6726 6.3820 3.8148 6.8654 4.6267 7.0127 2.4973 6.8984 8.1811 1.2832 1.6007 6.4008 3.1434 1.9582 1.7118 5.8326 7.0475 2.9503 1.7429 5.8344 1.3725 1.3996 2.2454 2.2003 1.3836 1.3544 3.6313 2.3507 3.1256 2.1809 1.5641 1.4287 1.3275 1.0858 1.7722 2.5263 1.9482 1.9997 1.7429 2.0173 2.5251 2.6129 2.4778 2.9260 3.7012 4.8657 6.7214 3.0667 2.9557 2.2015 2.9983 4.1322 3.8823 3.6371 8.2138 5.7342 7.3031 6.6587 6.7440 6.6119 7.4585 11.9371 1.0858 1.0883 1.0872 1.0886 1.0889 1.0949 1.0961 1.0965 1.1005 1.0917 1.0648 1.0667
irintensity: 1.8081 0.0256 0.1243 2.8869 2.2032 0.5755 0.2519 0.4847 0.0370 0.3275 51.6387 1.5772 73.5219 55.0893 4.5694 0.9229 1.3941 1.3949 1.8098 5.6023 6.7347 1.6733 4.1721 122.8605 2.3449 13.1397 0.5678 0.5064 8.8475 12.2781 8.1769 11.7749 0.7852 6.2217 3.6322 0.1660 2.0050 1.1155 8.4751 31.9707 38.2218 9.2574 5.4410 33.2539 7.9535 126.1287 32.1380 3.0193 0.1254 6.0743 32.5423 3.7990 2.5640 66.1736 64.7365 2.1085 0.1607 54.3079 18.7333 53.2537 62.4685 19.0010 9.1575 1.8175 1.9076 6.9938 61.5666 12.6089 10.2894 126.7937 4.9058 152.1714 13.6940 11.5189 1.8827 5.7648 2.8719 2.8638 6.6693 18.5845 43.1092 13.0112 12.9816 50.5669 20.5449 15.8026 1.2603 9.0182 2.5637 22.1724 15.0146 16.9003 3.6636 1.2766 14.6520 0.9639 8.1062 6.2424 26.3292 20.4344 2.6766 47.3132 32.3244 110.0208 111.7365
temp: 298.150 k
press: 1.00000 atm
elementType: 8 8 8 6 6 6 6 6 6 6 6 6 6 6 6 6 6 6 6 6 6 6 6 6 6 1 1 1 1 1 1 1 1 1 1 1 1
symmnumber: 1
zpe: 705844.5 jmol-1
zpe.correction: 0.268842 hartree
zpe.thermalcorrener: 0.287914 hartree
zpe.thermalcorrenthalpy: 0.288858 hartree
zpe.thermalcorrgfe: 0.221975 hartree
zpe.sumelectzpe: -1069.459246 hartree
zpe.sumelectthermal: -1069.440174 hartree
zpe.sumelectthermalent: -1069.439230 hartree
zpe.sumelectthermalfe: -1069.506113 hartree
dipole: 3.1721 2.4859 -0.0845
dipole: 4.0310
quadrupole: -87.2645 -131.4206 -151.0349
quadrupole: -3.2664 -0.1687 -0.0088
quadrupole: 35.9755 -8.1806 -27.7949 -3.2664 -0.1687 -0.0088
hfenergy: -1069.7280878 hartree
pointgroup: C01 [X(C22H12O3)]
dipole: 1.2590297 -0.9633671 0.0436877 debye
polarizability: 555.0453145|-13.5349823|274.4210498|1.0658338|-1.9343557|91.38571 unknown
InChI: InChI=1S/C22H12O3/c23-16-10-7-12-6-9-15-14-8-5-11-3-1-2-4-13(11)18(14)21-22(25-21)19(15)17(12)20(16)24/h1-10,23-24H
charge 0 multiplicity 1
37 atoms
O  -0.13903 2.685598 -0.079028
O  2.962809 2.314273 -0.080166
O  5.636213 2.052695 -0.029481
C  0.423832 1.231344 -0.133374
C  1.187318 0.064441 -0.085574
C  -0.900258 1.337722 -0.137551
C  -1.856228 0.32653 -0.096575
C  0.284367 -1.104497 -0.078611
C  -1.173877 -0.977771 -0.083975
C  2.627417 -0.089781 -0.054232
C  -3.300487 0.452179 -0.07282
C  3.200166 -1.411202 -0.027483
C  0.929872 -2.398734 -0.058138
C  -2.044415 -2.133927 -0.065342
C  -4.096562 -0.744391 -0.046476
C  2.306849 -2.545308 -0.033603
C  -3.425991 -2.02528 -0.0472
C  3.501144 1.030497 -0.053501
C  -3.943905 1.723454 -0.077411
C  4.616058 -1.570514 0.001184
C  -5.519401 -0.631763 -0.022344
C  4.900061 0.844871 -0.025691
C  5.464892 -0.451528 0.002443
C  -5.343814 1.811919 -0.053113
C  -6.13644 0.627584 -0.024843
H  0.315795 -3.302738 -0.059779
H  -1.606597 -3.135623 -0.061913
H  2.745563 -3.549697 -0.017518
H  -4.040473 -2.933236 -0.031195
H  -3.332361 2.632971 -0.100405
H  5.041104 -2.579078 0.022093
H  -6.125924 -1.544818 -0.001719
H  6.554303 -0.578141 0.024491
H  -5.830837 2.792922 -0.056664
H  -7.229016 0.705006 -0.006087
H  3.699042 2.98172 -0.077789
H  6.609711 1.895502 -0.010905
