program: Gaussian 09
title: 000154429
version: EM64L-G09RevD.01
frameworkgroup: C1[X(C22H12O3)]
method: RPBEPBE
basis: SDD
operation: Freq
keyword: #pfreq=noraman
keyword: PBEPBE/SDD
title: #p freq=noraman PBEPBE/SDD
converged: YES YES NO NO
title: Mulliken charges:
elementType: O O O C C C C C C C C C C C C C C C C C C C C C C H H H H H H H H H H H H
charge: -0.267037 -0.459001 -0.396591 0.143971 0.261808 0.238518 -0.008886 0.100136 0.411609 0.059694 0.436732 0.193448 -0.451776 -0.451049 -0.154660 -0.527128 0.032141 -0.487471 0.397490 -0.471596 -0.485802 -0.402661 -0.442280 -0.260986 -0.251087 0.280178 0.258394 0.223714 0.244474 0.244493 0.240208 0.273635 0.242193 0.229774 0.232172 0.383066 0.390163
chargesum: 0.00000
title: Mulliken charges with hydrogens summed into heavy atoms:
elementType: O O O C C C C C C C C C C C C C C C C C C C C C C
charge: -0.267037 -0.075935 -0.006428 0.143971 0.261808 0.238518 -0.008886 0.100136 0.411609 0.059694 0.436732 0.193448 -0.171598 -0.192655 -0.154660 -0.303414 0.032141 -0.242997 0.397490 -0.227103 -0.245594 -0.129026 -0.200087 -0.031212 -0.018915
polarizability: 4.94906605e+02 -1.02855057e+01 2.93837467e+02 -7.12064424e+00 -1.99798677e+00 9.97244812e+01
1716.lowfreq: -3.9683 -0.0006 -0.0001 0.0003 1.2869 5.9478 38.6418 51.5328 79.2564
frequency: 38.6352 51.5312 79.2556 100.7913 112.7334 142.4067 146.6887 174.4290 201.0970 210.5471 240.4775 253.8250 263.5105 270.6475 287.4333 304.3124 340.2183 369.0207 399.8669 426.7114 431.5938 456.3404 468.4967 472.5498 482.3022 496.9328 510.1915 530.3729 540.8136 557.9574 572.1837 586.0671 600.6250 607.9723 645.4155 649.4163 675.2045 693.8532 716.7844 758.6115 761.1816 779.9657 787.0542 793.4173 816.2280 823.7887 832.2656 862.8340 877.8784 886.9942 897.4401 948.3473 968.7095 977.9651 984.0551 989.5607 995.6437 1003.2001 1039.4885 1060.2047 1124.6053 1132.8602 1148.1956 1165.6073 1167.6892 1178.2691 1219.7892 1228.1328 1232.6680 1244.6840 1246.6326 1265.6988 1303.0870 1319.5543 1364.8729 1367.0588 1394.2469 1397.6853 1411.8954 1414.4677 1418.8055 1435.2006 1452.1575 1489.5331 1504.0423 1520.8905 1544.6348 1553.5625 1580.3272 1604.6927 1612.7130 1629.1296 1809.5578 3099.1510 3122.5533 3124.0955 3129.3973 3135.0181 3147.6057 3153.2347 3156.8543 3168.0517 3178.4823 3513.2616 3599.4705
redmass: 6.7401 6.3561 5.6985 6.5642 4.6679 10.1595 8.6291 5.2943 5.6629 5.2122 2.9967 5.1855 1.8127 5.0786 3.5985 5.5704 5.2512 7.2280 5.9356 4.0931 3.8337 6.1900 3.6730 2.3223 2.0516 4.6515 6.8095 3.6484 5.7760 5.2055 6.6069 4.6145 6.2838 4.7581 5.4375 5.8194 7.5953 3.9144 6.0012 1.6778 2.0032 5.2411 2.0351 5.7225 3.0057 1.9381 3.3762 1.6276 6.2165 1.5816 5.7566 1.3613 1.3341 1.8183 2.6494 1.4534 2.7971 1.4121 2.9765 2.8362 2.5138 1.9728 1.7525 1.2731 1.3308 1.1289 1.7749 1.7855 2.3573 1.6377 1.7899 2.2518 2.1250 3.4982 3.6924 3.3875 7.0945 4.2283 2.9816 4.7325 2.6058 3.2966 2.8510 3.4451 4.0806 4.6000 6.4068 6.5395 7.0707 6.5781 6.0809 6.7338 11.7520 1.0890 1.0865 1.0862 1.0870 1.0898 1.0988 1.0982 1.0957 1.0961 1.0935 1.0647 1.0662
irintensity: 0.4814 1.7475 1.0436 2.1721 2.5134 1.2114 2.7451 2.9853 5.1219 4.4810 35.1326 17.9593 76.6992 4.7651 4.5397 10.2211 7.1984 2.3750 0.6471 3.8025 4.1965 7.2773 19.6587 64.9055 75.1177 8.2781 0.6217 1.9886 5.6687 3.9955 4.1402 2.4168 56.1740 18.0287 0.5868 4.5186 4.8986 23.9670 1.1535 23.4856 44.4336 33.3166 9.8479 31.5208 28.3202 5.4978 15.4416 67.6252 42.6217 33.5727 20.1985 7.0139 0.1524 3.1647 2.1613 0.1753 0.7149 0.2799 11.8496 23.9865 33.8473 107.9219 44.5108 4.9927 8.5545 10.8198 117.4053 117.6148 37.2350 367.7652 12.1024 0.6801 1.1395 68.1612 10.1247 7.5552 14.3046 7.9997 17.6993 84.8925 29.0632 4.0842 36.7413 4.1236 28.2775 5.8223 24.8321 21.2771 14.1838 2.0250 2.1143 1.4802 60.0560 10.6677 1.1682 2.5381 3.9995 10.3877 30.2168 17.2430 40.0974 7.4649 13.3607 127.9765 30.8701
temp: 298.150 k
press: 1.00000 atm
elementType: 8 8 8 6 6 6 6 6 6 6 6 6 6 6 6 6 6 6 6 6 6 6 6 6 6 1 1 1 1 1 1 1 1 1 1 1 1
symmnumber: 1
zpe: 705582.4 jmol-1
zpe.correction: 0.268742 hartree
zpe.thermalcorrener: 0.287675 hartree
zpe.thermalcorrenthalpy: 0.288620 hartree
zpe.thermalcorrgfe: 0.222516 hartree
zpe.sumelectzpe: -1069.442329 hartree
zpe.sumelectthermal: -1069.423396 hartree
zpe.sumelectthermalent: -1069.422451 hartree
zpe.sumelectthermalfe: -1069.488555 hartree
dipole: 4.1546 -4.0350 -0.3217
dipole: 5.8004
quadrupole: -146.7802 -122.3516 -149.9979
quadrupole: 17.8412 1.1168 -3.0089
quadrupole: -7.0703 17.3583 -10.2880 17.8412 1.1168 -3.0089
hfenergy: -1069.711071 hartree
pointgroup: C01 [X(C22H12O3)]
dipole: 1.6660729 -1.5547588 -0.1214398 debye
polarizability: 495.1963687|-6.2512626|293.467043|-8.203627|-3.3749361|99.8051412 unknown
InChI: InChI=1S/C22H12O3/c23-19-16-10-9-14-15(18(16)21-22(25-21)20(19)24)8-7-12-6-5-11-3-1-2-4-13(11)17(12)14/h1-10,23-24H
charge 0 multiplicity 1
37 atoms
O  -4.279391 2.246241 0.608731
O  -4.097333 -2.728451 -0.242966
O  -6.124863 -1.025726 0.406569
C  -2.056036 0.525462 -0.105376
C  -0.68236 0.980073 -0.070679
C  0.386862 0.027324 -0.205515
C  -3.233075 1.272497 -0.028345
C  1.766612 0.479567 -0.080786
C  -2.38919 -0.892858 -0.295959
C  -4.493558 0.817999 0.07471
C  2.009794 1.898993 -0.110249
C  2.925217 -0.408021 0.072886
C  0.0210 -1.325077 -0.588921
C  -0.396775 2.379128 0.032701
C  -3.734713 -1.363979 -0.153205
C  -1.293416 -1.765154 -0.641609
C  -4.864149 -0.520457 0.132153
C  0.914609 2.824398 -0.044106
C  4.257687 0.13616 -0.097621
C  3.354657 2.409391 -0.224833
C  4.43814 1.555461 -0.282501
C  2.832918 -1.780001 0.481263
C  5.398721 -0.720891 -0.00832
C  3.967632 -2.595172 0.593859
C  5.262712 -2.075908 0.310184
H  0.807195 -2.001573 -0.931087
H  -1.227767 3.087283 0.119472
H  -1.4904 -2.780941 -1.009688
H  1.137236 3.897481 -0.044282
H  3.493098 3.494872 -0.286431
H  5.454613 1.943957 -0.413586
H  1.865603 -2.190615 0.779217
H  6.393111 -0.286369 -0.165844
H  3.85758 -3.634065 0.923865
H  6.143874 -2.722294 0.382457
H  -3.322274 -3.32756 -0.115396
H  -6.094172 -2.016075 0.320639
