program: Gaussian 09
title: 000013753
version: EM64L-G09RevD.01
frameworkgroup: C1[X(C13H10BrN3O2)]
method: RPBEPBE
basis: SDD
operation: Freq
keyword: #p
keyword: freq=noraman
keyword: PBEPBE/SDD
title: #p freq=noraman PBEPBE/SDD
converged: YES YES NO NO
title: Mulliken charges:
elementType: Br O O N N N C C C C C C C C C C C C C H H H H H H H H H H
charge: -0.055448 -0.222652 -0.221452 -0.421169 0.043596 0.019525 0.505398 -0.396600 -0.333516 0.386654 0.494839 -0.340816 -0.337632 -0.361738 -0.321661 -0.356394 -0.215663 -0.230804 -0.229959 0.238007 0.269825 0.287524 0.286413 0.304659 0.260371 0.241315 0.235327 0.235291 0.236759
chargesum: 0.00000
title: Mulliken charges with hydrogens summed into heavy atoms:
elementType: Br O O N N N C C C C C C C C C C C C C
charge: -0.055448 -0.222652 -0.221452 -0.116510 0.043596 0.019525 0.505398 -0.158593 -0.063690 0.386654 0.494839 -0.053292 -0.051218 -0.101367 -0.080346 -0.356394 0.019664 0.004488 0.006800
polarizability: 4.61047562e+02 1.30809756e+01 2.23690957e+02 3.53176822e-01 -1.29953404e-01 6.64425049e+01
1716.lowfreq: -0.0006 -0.0006 -0.0004 3.6943 8.4555 8.7574 28.6702 36.1468 40.1779
frequency: 28.3970 36.0192 40.0099 43.8925 77.7697 101.9653 130.7834 137.2913 153.8474 210.8288 253.5006 274.5221 280.1684 312.7285 393.4129 399.8575 418.3461 439.5622 448.7482 498.0265 512.2802 554.2250 562.9269 614.1687 622.9513 634.4100 640.5043 664.7110 667.0695 691.7157 732.8357 771.5643 773.9713 825.7730 828.8415 851.3741 858.4437 892.2476 937.1289 981.0639 986.4678 986.6754 993.6797 996.0081 1002.9395 1027.1357 1078.6207 1096.4435 1098.6947 1120.4019 1171.3929 1176.5092 1194.4202 1223.9423 1241.3680 1286.3272 1309.6738 1321.0584 1351.8847 1382.0219 1399.0666 1436.5013 1439.9819 1474.3222 1479.6752 1514.3831 1578.7877 1591.5354 1603.2195 1616.1901 1623.2478 3134.1648 3135.3161 3145.1029 3159.1973 3170.0143 3174.4781 3177.3069 3185.1380 3192.5101 3384.8593
redmass: 4.2001 5.8909 9.0403 7.8658 6.2566 6.8474 12.9122 9.8469 5.7863 9.4954 6.4759 6.1269 6.7907 4.7155 8.1530 2.8461 3.0030 7.6920 4.0781 2.9756 7.0921 4.2662 8.0729 6.5178 7.1716 1.3052 7.4106 4.7340 7.8328 1.8998 4.7066 8.4634 1.6955 6.1104 1.2997 1.2701 1.5823 6.1137 1.4162 1.3344 1.3837 6.1072 2.9433 1.3369 1.3268 2.3179 2.7823 2.7189 1.8548 1.4737 1.3580 1.0539 1.1214 5.1121 3.9295 1.3790 1.8884 1.3671 8.2947 6.7681 5.2097 2.3885 4.6717 2.1576 2.0514 2.7283 5.9109 7.0069 6.1236 6.9875 8.8884 1.0854 1.0908 1.0891 1.0933 1.0952 1.0885 1.1000 1.0947 1.0969 1.0755
irintensity: 0.2426 0.1125 1.2541 1.4125 0.3529 3.1601 0.6077 4.2951 0.0047 2.7476 11.5300 0.8749 3.7824 4.4582 5.9140 0.0140 0.1962 11.5838 0.3807 22.4670 8.3668 15.4559 1.7314 6.8421 17.0166 72.0118 54.8406 24.8493 5.5921 42.2434 3.9761 13.3406 65.7495 50.3440 15.1424 5.0938 67.4729 145.3939 6.0947 1.2718 0.0517 0.5808 1.4896 0.1507 0.1844 25.0321 126.0195 14.1961 56.0840 58.1473 239.6502 3.1937 17.7886 783.8018 67.9244 38.2880 118.6028 24.5816 65.5083 4.1361 106.4534 22.2668 17.5883 12.0443 4.4540 254.8029 1.0504 42.0604 2.8477 504.0606 113.9747 0.6251 8.0798 8.2330 19.1381 15.4811 0.5997 17.4663 1.2092 3.5241 64.2837
temp: 298.150 k
press: 1.00000 atm
elementType: 35 8 8 7 7 7 6 6 6 6 6 6 6 6 6 6 6 6 6 1 1 1 1 1 1 1 1 1 1
symmnumber: 1
zpe: 544052.9 jmol-1
zpe.correction: 0.207219 hartree
zpe.thermalcorrener: 0.223727 hartree
zpe.thermalcorrenthalpy: 0.224671 hartree
zpe.thermalcorrgfe: 0.159762 hartree
zpe.sumelectzpe: -828.118545 hartree
zpe.sumelectthermal: -828.102037 hartree
zpe.sumelectthermalent: -828.101092 hartree
zpe.sumelectthermalfe: -828.166001 hartree
dipole: 7.2952 -0.8370 -0.0054
dipole: 7.3431
quadrupole: -157.4199 -106.8868 -124.2061
quadrupole: 17.2092 0.1225 -0.0780
quadrupole: -27.9156 22.6175 5.2981 17.2092 0.1225 -0.0780
hfenergy: -828.3257634 hartree
pointgroup: C01 [X(C13H10Br1N3O2)]
dipole: -2.8141314 0.6459828 0.0980708 debye
polarizability: 460.776222|-13.2714631|223.0668858|-9.3862423|10.5638233|67.3379164 unknown
InChI: InChI=1S/C13H10BrN3O2/c14-13(10-4-2-1-3-5-10)16-15-11-6-8-12(9-7-11)17(18)19/h1-9,15H
charge 0 multiplicity 1
29 atoms
Br -2.534699 3.023062 0.240826
O  6.319063 0.016883 -0.136195
O  5.468104 -2.100849 -0.247579
N  0.075166 1.323357 0.078866
N  -1.035628 0.538697 0.053344
N  5.32715 -0.815867 -0.165762
C  1.358908 0.768022 0.01768
C  2.479577 1.647331 0.047739
C  1.557142 -0.638824 -0.073009
C  3.96277 -0.270552 -0.102679
C  -3.445736 0.142589 0.077013
C  3.780807 1.129969 -0.012346
C  2.85883 -1.155777 -0.133054
C  -3.264925 -1.270607 -0.035148
C  -4.766313 0.659663 0.154894
C  -2.247903 0.9996 0.107651
C  -4.37785 -2.129689 -0.06754
C  -5.877321 -0.209549 0.121822
C  -5.691697 -1.605505 0.010603
H  2.325766 2.730535 0.117493
H  0.687516 -1.29917 -0.094527
H  4.657164 1.782616 0.008716
H  3.0421 -2.231153 -0.202871
H  -0.048358 2.345238 0.144289
H  -2.249323 -1.671732 -0.095241
H  -4.923812 1.738714 0.241198
H  -4.222964 -3.210625 -0.154029
H  -6.888411 0.206596 0.183094
H  -6.556124 -2.277577 -0.015147
