program: Gaussian 09
title: 000154418
version: EM64L-G09RevD.01
frameworkgroup: C1[X(C5H3Br3O3)]
method: RPBEPBE
basis: SDD
operation: Freq
keyword: #p
keyword: freq=noraman
keyword: PBEPBE/SDD
title: #p freq=noraman PBEPBE/SDD
converged: YES YES NO NO
title: Mulliken charges:
elementType: Br Br Br O O O C C C C C H H H
charge: 0.138542 0.085301 0.117718 -0.208720 -0.397566 -0.164629 0.678726 -0.208365 -0.419968 -0.909612 0.268852 0.256194 0.376537 0.386988
chargesum: 0.00000
title: Mulliken charges with hydrogens summed into heavy atoms:
elementType: Br Br Br O O O C C C C C
charge: 0.138542 0.085301 0.117718 -0.208720 -0.010577 -0.164629 0.678726 0.047830 -0.419968 -0.533074 0.268852
polarizability: 1.23829632e+02 -6.28298056e+00 1.18819242e+02 8.76156878e-01 -2.41120808e+00 9.75539832e+01
1716.lowfreq: -6.9359 -3.4241 -0.0001 0.0004 0.0005 4.6019 20.9848 56.8751 76.7645
frequency: 20.8259 56.8734 76.7620 87.8702 119.2468 132.9670 184.5790 207.1035 236.8827 303.6797 345.6691 405.6591 441.8348 506.4816 530.6927 610.8753 636.2507 657.3714 701.0570 758.5645 862.8289 916.4988 946.3311 1037.2779 1080.3539 1136.3458 1166.2782 1180.6928 1275.6824 1299.0059 1375.8893 1632.6271 1715.3482 2993.0830 3137.5810 3567.0046
redmass: 26.1353 13.6850 31.2248 13.4998 13.0815 16.9019 13.2477 21.9069 12.7062 5.1998 1.3983 6.7450 6.0905 8.4749 10.7889 8.4369 6.6800 7.3251 11.0537 8.5930 11.9241 8.5088 5.4194 4.8759 6.7473 1.4492 1.2425 1.2508 1.2628 1.6484 1.6597 9.8628 13.0545 1.0841 1.0879 1.0663
irintensity: 0.1757 2.9437 0.3328 1.0698 0.3791 0.8176 0.8421 1.1119 3.7738 12.0182 114.6307 24.6710 60.4312 32.9646 14.9616 60.7295 81.4930 12.2442 28.5834 12.2563 201.3210 42.1229 17.4971 157.5870 98.4774 18.6180 52.2399 18.1207 1.7518 12.6725 31.9934 45.7127 362.1848 23.6358 0.9381 35.5703
temp: 298.150 k
press: 1.00000 atm
elementType: 35 35 35 8 8 8 6 6 6 6 6 1 1 1
symmnumber: 1
zpe: 193460.5 jmol-1
zpe.correction: 0.073685 hartree
zpe.thermalcorrener: 0.085506 hartree
zpe.thermalcorrenthalpy: 0.086450 hartree
zpe.thermalcorrgfe: 0.031432 hartree
zpe.sumelectzpe: -457.525684 hartree
zpe.sumelectthermal: -457.513863 hartree
zpe.sumelectthermalent: -457.512919 hartree
zpe.sumelectthermalfe: -457.567938 hartree
dipole: -2.4163 3.0148 -0.6333
dipole: 3.9152
quadrupole: -110.7144 -73.3407 -91.1581
quadrupole: 1.8471 0.7242 -1.7331
quadrupole: -18.9767 18.3970 0.5796 1.8471 0.7242 -1.7331
hfenergy: -457.5993694 hartree
pointgroup: C01 [X(C5H3Br3O3)]
dipole: 0.7327111 -1.2253305 -0.5782755 debye
dipolederiv: 0.0699992 -0.1716927 -0.043701 0.0189289 -0.4582247 -0.1375436 0.0077012 -0.1349146 0.061247 -0.3653176 0.0428556 0.2745553 -0.1490727 -0.0406122 0.2449068 0.2725932 0.0675683 -0.621917 -0.2834255 0.0700838 -0.2327006 -0.0777181 0.0215602 -0.1060097 -0.2486513 0.0495833 -0.5670263 -0.7343522 0.2147007 -0.0506598 0.0971317 -1.1777333 -0.1183001 0.04322 -0.2024339 -0.3402644 -0.4030077 0.1462166 0.1539269 0.1810461 -0.897147 0.1642083 0.0948495 0.3982639 -0.4537429 -1.0024372 0.3341434 0.0740183 0.2873689 -0.6306282 -0.0645738 0.0521472 -0.0809016 -0.3064993 -0.1177958 -0.0013508 0.0174771 -0.0467299 -0.4611112 -0.0591861 -0.0877539 -0.0296791 -0.1827904 0.5665289 -0.2888646 -0.0022257 -0.0340021 1.1492774 -0.1271088 0.0369144 -0.3284167 0.6024554 -0.6046413 0.2187728 0.0659268 0.0142442 0.9517003 0.2508905 0.0057835 0.2606485 -0.0278054 0.8499597 -0.213296 -0.097389 0.1288654 0.1148025 -0.1376961 0.0076254 -0.1826854 1.3997625 1.696357 -0.1801577 -0.0555208 -0.3731475 1.1927766 0.1696077 -0.0911839 0.2430914 0.3447191 0.0385476 0.0190066 0.006155 0.0321953 -0.08402 -0.0427808 0.0294052 0.0100099 -0.1054748 0.0372273 -0.0611923 -0.0049502 0.002947 0.0286154 -0.0006112 -0.0066265 -0.001431 -0.0922742 0.2523576 -0.1292254 -0.1049124 -0.0820571 0.2907443 -0.0358032 -0.1160242 -0.068703 0.2896108 unknown
polarizability: 121.5860988|-6.1568936|118.4662287|-2.8752492|7.771111|100.1505292 unknown
InChI: InChI=1S/C5H3Br3O3/c6-2-1(3(7)8)4(9)11-5(2)10/h3-4,9H
charge 0 multiplicity 1
14 atoms
Br 0.126747 2.600488 0.546625
Br 2.7479 0.425349 -1.731671
Br 2.748525 0.068708 1.586712
O  -1.897513 -0.913193 -0.377125
O  -0.252646 -2.506198 0.417193
O  -2.845695 1.165632 0.151122
C  0.403071 -0.262134 -0.146735
C  -0.504862 -1.4387 -0.498819
C  -0.382776 0.824393 0.10362
C  1.871325 -0.483925 -0.135841
C  -1.840521 0.468391 -0.008722
H  -0.408739 -1.759135 -1.556411
H  2.121794 -1.546288 -0.245458
H  -0.809011 -3.295188 0.192308
