program: Gaussian 09
title: 000013785
version: EM64L-G09RevD.01
frameworkgroup: C1[X(C21H25NO)]
method: RPBEPBE
basis: SDD
operation: Freq
keyword: #p
keyword: freq=noraman
keyword: PBEPBE/SDD
title: #p freq=noraman PBEPBE/SDD
converged: YES YES NO NO
title: Mulliken charges:
elementType: O N C C C C C C C C C C C C C C C C C C C C C H H H H H H H H H H H H H H H H H H H H H H H H H
charge: -0.205926 -0.058720 -0.363957 -0.369470 -0.402750 -0.388419 -0.398485 -0.467433 -0.355707 -0.575861 0.211759 0.475745 0.447677 -0.444694 -0.402255 -0.391663 -0.402372 -0.228580 -0.231767 -0.229982 -0.252767 -0.246989 -0.242735 0.252256 0.163665 0.167358 0.207761 0.212498 0.190875 0.189970 0.207753 0.186975 0.213601 0.238216 0.215713 0.263733 0.248556 0.228417 0.256866 0.238077 0.247576 0.241088 0.226604 0.225314 0.223386 0.223488 0.227488 0.228120
chargesum: 0.00000
title: Mulliken charges with hydrogens summed into heavy atoms:
elementType: O N C C C C C C C C C C C C C C C C C C C C C
charge: -0.205926 -0.058720 0.051965 0.005649 0.000622 0.009304 0.002091 -0.013504 -0.091974 -0.098889 0.211759 0.475745 0.447677 -0.187828 -0.164178 -0.144087 -0.161285 -0.001977 -0.006453 -0.006596 -0.029280 -0.019501 -0.014615
polarizability: 2.68255021e+02 -2.59459987e+01 2.15766766e+02 9.44218343e+00 -1.51812815e+01 1.91022093e+02
1716.lowfreq: -10.5532 -8.4992 -5.3272 -1.3111 -0.0007 -0.0006 0.0005 18.1772 24.2750
frequency: -6.7035 18.0251 23.9049 35.8231 40.9582 55.7614 65.4285 94.1685 112.5718 140.9758 172.1358 207.7269 217.8798 231.6030 242.1017 281.0522 293.2348 302.6514 313.9522 375.4297 397.5293 400.9587 405.4182 443.9841 451.1225 467.4663 480.2278 538.6916 556.3569 580.5745 610.4355 615.9148 624.4676 682.8785 704.5241 707.9242 735.2050 761.6357 767.4748 777.7088 804.6153 818.0735 845.0505 852.5049 855.2843 857.0616 858.5891 892.9827 919.7656 924.8326 941.8989 957.5128 976.1436 978.9657 985.8167 987.9769 991.4687 994.2911 994.9240 996.1045 1017.5090 1027.9755 1033.4257 1051.2379 1067.4353 1078.3629 1081.4770 1099.7331 1117.1073 1127.9739 1150.9374 1156.7288 1170.8369 1171.5265 1172.4353 1188.8547 1192.6279 1192.8868 1206.2667 1221.0283 1247.8420 1258.3367 1265.3968 1276.2217 1280.8056 1299.0223 1315.8285 1327.8631 1334.6222 1339.4751 1340.8332 1345.9374 1349.5981 1368.1731 1378.5525 1383.3991 1384.7256 1426.7921 1435.4361 1439.0454 1442.0200 1451.6381 1460.2803 1463.1111 1463.6599 1474.3200 1480.0377 1484.7584 1589.1781 1592.3354 1609.1975 1614.8421 1637.9067 2770.7309 2812.4023 2826.3076 2964.8027 2968.9708 2984.4000 2985.3701 2988.8657 2999.0447 3013.9423 3033.3122 3041.0353 3046.6859 3055.6570 3076.2985 3117.6902 3118.3217 3122.9036 3123.7069 3135.3483 3136.7790 3144.7082 3146.2381 3161.3278 3162.7035
redmass: 4.5702 4.0833 3.1561 3.9933 3.8389 4.6065 4.1929 6.7730 3.6547 3.9187 3.8791 3.1129 3.9550 2.4169 3.1528 4.2324 2.3372 2.9483 3.6696 1.7124 3.7076 2.8426 2.8780 2.8771 2.5672 3.6513 2.7520 2.1969 3.3602 2.9382 4.8282 6.3797 5.2671 4.8374 1.7515 1.7167 2.6521 2.1688 2.5985 2.2783 1.4901 3.2630 2.1231 1.2601 2.5882 1.2629 1.7109 2.5613 1.5409 1.4940 2.2821 1.2952 1.3957 1.4485 2.6271 4.0938 4.8663 1.4543 1.3679 2.5338 3.1031 2.1412 2.2864 2.0792 1.8346 1.5501 1.5466 2.0552 2.2887 2.2270 1.2407 1.4266 1.0627 2.0117 1.0734 1.1545 1.7792 1.3245 1.7294 1.6092 1.3907 1.4073 1.2498 1.4637 1.4586 1.4063 1.4264 1.3874 1.3991 1.3376 1.4141 1.4166 1.4824 1.4439 7.1121 1.3817 6.1594 1.1449 1.8225 1.2403 2.0897 1.0901 1.0878 1.0911 1.0899 1.1003 2.2334 2.2597 6.0259 5.9251 6.0305 6.0422 8.4490 1.0698 1.0715 1.0700 1.0628 1.0609 1.0630 1.0811 1.0613 1.0832 1.0868 1.0960 1.0985 1.1033 1.1031 1.0881 1.0860 1.0847 1.0865 1.0873 1.0920 1.0915 1.0963 1.0957 1.1015 1.1015
irintensity: 0.1432 0.0296 1.1239 0.0653 0.1088 0.3351 0.3918 3.1011 3.4380 1.6989 0.3865 3.6819 1.0068 0.9667 2.4142 1.0953 5.1065 0.1179 1.8909 4.4033 2.7566 0.5910 0.4150 0.5196 0.5619 4.9272 1.1270 22.1002 3.0106 12.8225 9.4582 0.7830 6.7575 5.6592 50.5533 62.9771 10.4608 43.2256 5.6356 28.3290 0.0647 3.1362 0.4326 0.5322 2.9866 1.3721 9.1081 1.0718 3.1906 1.4673 2.0714 3.7441 0.5179 0.1726 21.2362 11.7760 2.0910 3.2902 5.6757 20.2312 1.2117 8.7903 14.9924 3.9594 27.0035 18.2246 22.0108 70.6617 17.0579 4.2426 3.3043 6.6988 0.4715 35.2354 0.6552 2.1555 4.0859 1.1552 10.4802 2.5286 26.5949 12.0871 3.0909 13.9610 10.5586 5.5717 18.7180 0.2334 1.7638 2.1682 2.1240 4.0667 3.5260 8.2577 0.8270 13.2274 0.1797 12.8049 17.7917 8.9689 4.2051 6.4319 11.7129 6.5443 12.7647 5.2596 23.1206 17.6440 5.1963 0.1426 12.5134 7.6040 68.5941 94.4837 44.8500 161.8735 40.0716 11.5608 30.4904 25.7001 31.5661 4.7365 62.3634 65.4074 16.7573 24.0244 83.2880 11.1188 6.3234 2.7781 0.6788 0.3242 15.1640 16.6244 31.7812 46.4759 27.7862 21.9156
temp: 298.150 k
press: 1.00000 atm
elementType: 8 7 6 6 6 6 6 6 6 6 6 6 6 6 6 6 6 6 6 6 6 6 6 1 1 1 1 1 1 1 1 1 1 1 1 1 1 1 1 1 1 1 1 1 1 1 1 1
symmnumber: 1
zpe: 1067038.2 jmol-1
zpe.correction: 0.406413 hartree
zpe.thermalcorrener: 0.426624 hartree
zpe.thermalcorrenthalpy: 0.427568 hartree
zpe.thermalcorrgfe: 0.355070 hartree
zpe.sumelectzpe: -943.504266 hartree
zpe.sumelectthermal: -943.484056 hartree
zpe.sumelectthermalent: -943.483111 hartree
zpe.sumelectthermalfe: -943.555610 hartree
dipole: 0.1623 0.1817 2.9149
dipole: 2.9250
quadrupole: -129.3555 -132.4241 -136.2480
quadrupole: -4.3969 -2.9649 -6.9542
quadrupole: 3.3204 0.2518 -3.5721 -4.3969 -2.9649 -6.9542
hfenergy: -943.9106799 hartree
pointgroup: C01 [X(C21H25N1O1)]
dipole: 0.0164314 0.1224642 -1.1441484 debye
polarizability: 265.8673706|28.3322629|221.9871431|-7.6298573|-11.5252459|187.189366 unknown
InChI: InChI=1S/C21H25NO/c23-20(17-22-14-8-3-9-15-22)16-21(18-10-4-1-5-11-18)19-12-6-2-7-13-19/h1-2,4-7,10-13,21H,3,8-9,14-17H2
charge 0 multiplicity 1
48 atoms
O  -1.146084 0.508636 1.725064
N  -3.512693 0.863575 0.083122
C  -3.79164 -0.542084 0.483472
C  -4.557224 1.395848 -0.829599
C  -5.162769 -0.6537 1.178357
C  -5.947937 1.342721 -0.165887
C  -6.288188 -0.099011 0.27593
C  -2.164697 1.054867 -0.453008
C  1.501225 0.364696 0.469725
C  0.367797 1.319065 -0.006204
C  -1.00893 0.915667 0.542783
C  1.345615 -1.013028 -0.200461
C  2.907435 0.944877 0.273299
C  0.672311 -2.063551 0.474284
C  3.986459 0.373162 0.998701
C  1.829873 -1.248024 -1.513635
C  3.190231 2.010565 -0.617745
C  0.484332 -3.318928 -0.148652
C  5.304288 0.851532 0.844074
C  1.640863 -2.500316 -2.138781
C  4.510365 2.494173 -0.777285
C  0.966363 -3.541662 -1.458628
C  5.573005 1.917242 -0.047994
H  -2.993334 -0.867872 1.168961
H  -3.776303 -1.21561 -0.415903
H  -4.590866 0.815596 -1.791458
H  -4.300243 2.442156 -1.084129
H  -5.126057 -0.079673 2.1239
H  -5.354906 -1.713092 1.436022
H  -6.707271 1.726579 -0.874459
H  -5.94357 2.008355 0.718704
H  -6.391526 -0.74397 -0.62183
H  -7.259852 -0.122578 0.804738
H  -2.087213 2.071375 -0.892198
H  -1.913499 0.351451 -1.299068
H  1.337617 0.223575 1.556161
H  0.570066 2.342701 0.373991
H  0.330578 1.378616 -1.110194
H  0.291559 -1.891529 1.488085
H  3.785886 -0.457233 1.687091
H  2.377118 -0.45533 -2.037835
H  2.382448 2.476735 -1.192559
H  -0.034767 -4.120614 0.389081
H  6.120285 0.397459 1.417729
H  2.026323 -2.66808 -3.15117
H  4.706496 3.320785 -1.469936
H  0.82472 -4.515234 -1.941439
H  6.595413 2.29211 -0.169618
