program: Gaussian 09
title: 000154409
version: EM64L-G09RevD.01
frameworkgroup: C1[X(C12H5Br5)]
method: RPBEPBE
basis: SDD
operation: Freq
keyword: #pfreq=noraman
keyword: PBEPBE/SDD
title: #p freq=noraman PBEPBE/SDD
converged: NO YES NO NO
title: Mulliken charges:
elementType: Br Br Br Br Br C C C C C C C C C C C C H H H H H
charge: 0.110844 0.070802 0.041000 0.121917 0.091520 0.450964 0.309545 -0.321092 -0.363923 -0.349239 -0.290991 -0.156001 -0.153529 -0.185059 -0.184281 -0.226134 -0.227521 0.247681 0.284084 0.253582 0.237192 0.238638
chargesum: 0.00000
title: Mulliken charges with hydrogens summed into heavy atoms:
elementType: Br Br Br Br Br C C C C C C C C C C C C
charge: 0.110844 0.070802 0.041000 0.121917 0.091520 0.450964 0.309545 -0.321092 -0.363923 -0.349239 -0.043310 -0.156001 0.130555 -0.185059 0.069301 0.011058 0.011116
polarizability: 2.80938179e+02 2.76115504e+00 2.04522202e+02 2.51475870e+01 4.53688934e+00 1.51790648e+02
1716.lowfreq: -4.9709 -4.0604 -0.0003 -0.0003 -0.0003 1.9795 21.4137 24.8798 41.2510
frequency: 21.3955 24.8669 41.2500 53.2042 65.2507 114.1081 122.5882 127.3472 133.3354 140.7029 176.8815 204.1205 221.9899 240.4034 258.2170 284.8695 306.7144 413.6291 420.0343 444.8073 467.1245 492.5530 518.9462 585.4823 613.1390 635.4963 674.4242 722.7903 731.0320 733.6517 761.8370 792.0731 866.2745 871.4767 949.9800 976.3622 989.9325 1012.1011 1039.6308 1088.8072 1121.2346 1146.5773 1174.2734 1237.8892 1260.9145 1296.6862 1317.5599 1357.1559 1388.1991 1417.9397 1464.8463 1505.9869 1548.2438 1567.4231 1600.8172 3136.0889 3146.2322 3162.8278 3175.7072 3187.8591
redmass: 20.2923 21.5951 65.2370 6.8041 40.4534 19.0128 8.5428 7.7945 11.9496 55.6396 9.8813 54.2630 70.5608 7.7142 5.6944 8.6734 10.6668 5.2410 8.3030 5.7612 4.9726 7.7108 4.6583 4.6045 9.6806 6.9220 8.3229 9.3909 3.7925 8.0619 1.3222 7.9953 1.3675 1.4052 1.3793 8.9210 1.3340 7.2129 2.6310 3.8666 1.6957 2.0552 1.0555 2.3959 1.8573 3.6760 10.0751 8.5397 2.8039 2.2301 3.0410 9.6538 9.4838 6.1120 7.1634 1.0861 1.0907 1.0952 1.1001 1.0932
irintensity: 0.0773 0.1279 0.0051 0.6674 0.1524 0.0702 0.0603 0.3430 0.0206 0.0997 0.6451 0.0321 0.0085 0.9159 0.4816 0.9682 4.4840 1.4914 1.3523 14.5205 2.9596 23.0144 5.5049 17.0405 1.2325 3.6307 27.8739 41.4007 3.3662 3.2892 62.6759 9.3456 0.3813 13.7715 0.1043 30.1083 0.0272 38.1638 14.3383 2.0768 2.6036 50.4486 0.3099 17.7227 24.2582 94.5126 1.0281 3.1142 112.6614 40.0948 8.4934 31.6062 43.9719 11.4855 2.5058 0.5464 9.6572 11.7504 15.3444 0.9343
temp: 298.150 k
press: 1.00000 atm
elementType: 35 35 35 35 35 6 6 6 6 6 6 6 6 6 6 6 6 1 1 1 1 1
symmnumber: 1
zpe: 332282.5 jmol-1
zpe.correction: 0.126560 hartree
zpe.thermalcorrener: 0.143684 hartree
zpe.thermalcorrenthalpy: 0.144628 hartree
zpe.thermalcorrgfe: 0.076024 hartree
zpe.sumelectzpe: -526.381168 hartree
zpe.sumelectthermal: -526.364044 hartree
zpe.sumelectthermalent: -526.363100 hartree
zpe.sumelectthermalfe: -526.431704 hartree
dipole: -1.9343 0.1481 -1.8246
dipole: 2.6631
quadrupole: -129.7247 -142.2140 -140.4622
quadrupole: 5.2391 6.2222 1.0132
quadrupole: 7.7423 -4.7471 -2.9953 5.2391 6.2222 1.0132
hfenergy: -526.5077279 hartree
pointgroup: C01 [X(C12H5Br5)]
dipole: -0.8164713 -0.1627417 0.6361574 debye
dipolederiv: -0.1100993 0.2563686 0.0018403 0.2342565 -0.4990846 -0.0013021 0.0077256 -0.0069284 0.0394124 -0.2487928 -0.2935253 0.0086781 -0.3120027 -0.5074083 0.0147084 0.0156985 0.0158192 0.0143506 -0.1451682 0.0170169 0.2095452 0.0157194 -0.007206 -0.027953 0.1719746 -0.0293727 -0.5578691 -0.2253883 -0.3177477 -0.0016879 -0.3685873 -0.3306569 0.0021295 0.0072128 0.007987 0.0439835 -0.6835982 0.1319156 0.001122 0.1747298 -0.0237949 -0.0010996 0.0133861 -0.0022183 0.0207624 0.2019042 -0.1229668 0.0662876 -0.0006095 -0.5005575 -0.0007682 0.0490894 0.0037568 0.0605329 0.1961841 -0.0000447 0.1687663 -0.0107058 0.0421824 -0.0208365 0.0432666 -0.0128354 -0.2759267 0.1020421 -0.393363 -0.0137585 -0.518564 0.7357434 0.01418 -0.016238 -0.0128449 -0.0801946 0.4007503 0.5086333 -0.0317253 0.4080505 0.9340699 -0.0359013 -0.0273868 -0.0021087 -0.119247 0.1072568 -0.0364619 -0.4771318 -0.0275271 -0.1012246 0.0584091 -0.2320872 0.0520689 0.9673122 -0.1102355 -0.0083981 -0.0173656 -0.0029027 -0.0945653 0.0085424 -0.0385706 0.0026848 0.0663188 -0.013367 0.7253359 -0.0040941 0.7459988 0.3552671 -0.0057613 -0.0080021 -0.0146265 -0.0604345 -0.5371326 -0.078742 0.0060642 -0.1281003 -0.2735559 0.0129102 0.0070126 0.0036495 -0.0259764 1.1066356 -0.4329752 -0.0145702 -0.2674032 0.0320177 -0.0022878 -0.0238363 0.0088324 -0.0909598 -0.1391254 0.0070873 0.1967476 0.0091206 -0.0848875 -0.0207256 0.1765165 -0.0226244 -0.2347264 -0.0644013 -0.0088916 -0.0923545 -0.006543 -0.137919 0.0099201 -0.0461979 0.0044095 0.0403218 0.1047805 -0.0252974 0.0368905 -0.0239451 -0.1339269 -0.0017888 -0.0414556 0.0086381 0.0713492 0.0438918 0.0094992 -0.0758862 0.00561 0.1224892 0.0044114 -0.094884 0.0044015 -0.0274505 0.0626503 0.0156998 -0.0012855 0.0229243 0.0232529 0.0015698 0.0035208 -0.0006053 0.1517701 0.0404443 0.0089874 -0.0581871 0.0100674 0.1468012 0.0043594 -0.0749921 0.0053165 -0.0050315 0.0249782 0.0117057 0.0695233 0.013607 0.1498267 -0.0094108 0.0910695 -0.0103526 -0.0663281 -0.1142095 0.0261638 0.0225816 0.0268065 0.1531369 -0.0033053 0.0171777 -0.003047 0.0680307 unknown
polarizability: 283.9836522|8.5833247|205.5092526|-11.3118852|0.597448|147.7581235 unknown
InChI: InChI=1S/C12H5Br5/c13-7-4-2-1-3-6(7)10-8(14)5-9(15)11(16)12(10)17/h1-5H
charge 0 multiplicity 1
22 atoms
Br 0.239481 2.728799 0.103767
Br -0.357557 -3.055011 0.172645
Br -1.315771 -0.034845 -2.741894
Br 3.627106 2.349526 0.035233
Br 4.915651 -0.840739 0.028092
C  0.161692 -0.167122 0.133661
C  -1.325789 0.000683 0.194865
C  1.040817 0.953314 0.106127
C  0.759494 -1.453423 0.135496
C  -2.137324 0.06928 -0.964548
C  -1.96621 0.079251 1.459178
C  2.45463 0.803945 0.073861
C  2.153656 -1.636062 0.102325
C  2.996264 -0.506917 0.071698
C  -3.537399 0.213476 -0.882758
C  -3.365303 0.223038 1.559876
C  -4.151512 0.290297 0.387407
H  -1.349269 0.02703 2.362959
H  2.58252 -2.639884 0.099659
H  -4.136559 0.264315 -1.796294
H  -3.837615 0.2819 2.545729
H  -5.239004 0.401649 0.452915
