program: Gaussian 09
title: 000154395
version: EM64L-G09RevD.01
frameworkgroup: C1[X(C14H9Cl5)]
method: RPBEPBE
basis: SDD
operation: Freq
keyword: #pfreq=noraman
keyword: PBEPBE/SDD
title: #p freq=noraman PBEPBE/SDD
converged: YES YES NO NO
title: Mulliken charges:
elementType: Cl Cl Cl Cl Cl C C C C C C C C C C C C C C H H H H H H H H H
charge: 0.072214 0.119386 0.120228 -0.047708 -0.047620 -0.339525 0.673018 0.673709 -0.622378 -0.374434 -0.373639 -0.337513 -0.336221 -0.222376 -0.222056 -0.254710 -0.254120 -0.230857 -0.231047 0.301757 0.234265 0.232545 0.259821 0.259785 0.234641 0.234720 0.239064 0.239050
chargesum: 0.00000
title: Mulliken charges with hydrogens summed into heavy atoms:
elementType: Cl Cl Cl Cl Cl C C C C C C C C C C C C C C
charge: 0.072214 0.119386 0.120228 -0.047708 -0.047620 -0.037768 0.673018 0.673709 -0.622378 -0.374434 -0.373639 -0.103247 -0.103676 0.037445 0.037730 -0.020069 -0.019400 0.008207 0.008003
polarizability: 2.19695625e+02 -3.83813932e-01 1.43060556e+02 -4.04091802e-01 1.84751303e+01 2.09264967e+02
1716.lowfreq: -25.0815 -2.3795 0.0009 0.0015 0.0022 3.4546 5.0312 45.7387 47.4690
frequency: -25.0355 45.7365 47.4688 59.6940 69.3251 110.6954 130.6099 157.9033 163.6881 176.6630 195.2351 199.9022 248.5752 269.0621 273.7991 274.8007 338.7565 353.7460 369.2473 395.4263 414.4358 439.2078 461.3718 500.6193 509.5490 585.5764 590.6712 621.1995 659.1999 662.8452 698.9963 726.7376 731.5073 752.3786 755.9207 774.4491 811.1486 847.8000 868.8252 885.9518 940.3789 951.4203 984.1767 987.0941 1010.1140 1011.2184 1022.7737 1043.3802 1049.2913 1119.5056 1133.3161 1173.6897 1174.8275 1185.8666 1204.7969 1245.3974 1280.0117 1311.5416 1327.2360 1378.6812 1386.4564 1426.4138 1426.8501 1457.1348 1464.0393 1574.2775 1577.5081 1600.7305 1603.9920 3002.8270 3140.8481 3141.2482 3157.6837 3158.6756 3175.1942 3176.4130 3186.0290 3197.2258
redmass: 9.2966 22.0678 6.5386 10.6703 7.5799 13.0754 5.9140 5.7124 20.7994 15.9993 11.4907 9.0697 5.5616 16.5700 7.2211 19.1527 7.9451 6.3066 11.2579 12.8342 9.6195 3.0985 3.5845 5.0245 4.1354 5.1127 6.8493 6.8869 6.4232 7.4541 5.1732 6.2529 2.8649 2.0489 1.6166 1.9634 5.3827 1.4475 1.3847 4.4249 1.4042 1.4049 1.3372 1.3488 7.2205 6.5996 6.4591 2.0473 2.3755 1.7914 1.7882 1.0733 1.3783 1.5587 1.9475 1.8684 1.4759 1.6134 1.4932 3.5528 3.1201 1.9975 2.1520 2.4913 2.3456 5.7851 6.0002 6.9784 6.8886 1.0809 1.0863 1.0864 1.0919 1.0924 1.0963 1.0977 1.0970 1.0926
irintensity: 0.2477 0.0387 0.2886 0.9713 0.0011 0.3882 0.1082 0.1972 0.7871 0.0252 0.8809 0.8872 2.7423 0.8746 0.0659 0.4621 1.3535 3.2833 1.7417 12.5919 2.6780 8.6901 6.1739 13.7186 0.3371 55.7720 51.3334 41.3835 18.8642 17.3475 40.0789 49.3591 9.6359 130.3953 81.3297 20.1671 24.7475 0.3091 1.1379 3.5005 0.8128 0.5737 0.0167 0.8062 19.8955 0.3366 102.5195 8.8570 6.9492 0.0930 1.2832 3.3077 1.1886 0.0195 3.4191 0.2933 0.5705 24.4404 1.2566 0.6071 4.1740 1.5457 43.0453 22.3039 39.8979 0.1812 9.9475 1.5864 5.9271 34.5256 0.5057 3.2985 12.9174 16.5522 18.4701 5.3158 0.1911 8.9002
temp: 298.150 k
press: 1.00000 atm
elementType: 17 17 17 17 17 6 6 6 6 6 6 6 6 6 6 6 6 6 6 1 1 1 1 1 1 1 1 1
symmnumber: 1
zpe: 487878.9 jmol-1
zpe.correction: 0.185823 hartree
zpe.thermalcorrener: 0.202962 hartree
zpe.thermalcorrenthalpy: 0.203906 hartree
zpe.thermalcorrgfe: 0.139807 hartree
zpe.sumelectzpe: -2837.829725 hartree
zpe.sumelectthermal: -2837.812586 hartree
zpe.sumelectthermalent: -2837.811642 hartree
zpe.sumelectthermalfe: -2837.875741 hartree
dipole: -0.0364 -1.7854 3.9370
dipole: 4.3231
quadrupole: -128.0285 -149.8577 -136.4558
quadrupole: -0.0613 -0.0215 -0.2617
quadrupole: 10.0855 -11.7437 1.6582 -0.0613 -0.0215 -0.2617
hfenergy: -2838.0155483 hartree
pointgroup: C01 [X(C14H9Cl5)]
dipole: -0.0159893 1.4226386 -0.9320119 debye
polarizability: 219.7013951|-0.6719278|145.3315578|0.240022|-22.0511118|206.9881941 unknown
InChI: InChI=1S/C14H9Cl5/c15-11-7-3-1-5-9(11)13(14(17,18)19)10-6-2-4-8-12(10)16/h1-8,13H
charge 0 multiplicity 1
28 atoms
Cl -0.029866 -2.127893 -2.302834
Cl -1.518835 -3.000899 0.165961
Cl 1.503885 -3.011275 0.133124
Cl -1.807382 -0.071627 2.743213
Cl 1.916518 -0.123274 2.677398
C  0.001105 -0.644582 0.203167
C  -1.293612 0.151674 -0.039641
C  1.290773 0.146963 -0.078423
C  -0.009941 -2.069055 -0.424097
C  -2.160383 0.485015 1.035133
C  2.203856 0.456273 0.964787
C  -1.685228 0.61672 -1.324888
C  1.632113 0.630544 -1.371043
C  -3.337361 1.24014 0.86477
C  3.379166 1.204718 0.757198
C  -2.861167 1.368687 -1.522268
C  2.805101 1.376317 -1.605517
C  -3.690693 1.688062 -0.425317
C  3.68253 1.670593 -0.539222
H  0.016837 -0.875402 1.28624
H  -1.072274 0.369916 -2.193352
H  0.979357 0.405962 -2.216242
H  -3.966441 1.467047 1.729989
H  4.045387 1.412959 1.598977
H  -3.127841 1.70123 -2.530673
H  3.031884 1.723925 -2.618587
H  -4.605118 2.273708 -0.565192
H  4.595429 2.251053 -0.707758
