program: Gaussian 09
title: 000154386
version: EM64L-G09RevD.01
frameworkgroup: C1[X(C20H15BrO)]
method: RPBEPBE
basis: SDD
operation: Freq
keyword: #p
keyword: freq=noraman
keyword: PBEPBE/SDD
title: #p freq=noraman PBEPBE/SDD
converged: YES YES NO NO
title: Mulliken charges:
elementType: Br O C C C C C C C C C C C C C C C C C C C C H H H H H H H H H H H H H H H
charge: 0.001990 -0.429959 0.369775 0.275119 0.263209 -0.554454 0.448264 -0.359097 -0.357906 -0.387755 -0.397781 -0.389149 -0.349941 -0.363988 -0.384399 0.280349 -0.228427 -0.228298 -0.246437 -0.231375 -0.227020 -0.240641 0.264887 0.253477 0.255489 0.254791 0.221002 0.251994 0.254190 0.254634 0.228250 0.227108 0.229110 0.228705 0.229046 0.229874 0.355365
chargesum: 0.00000
title: Mulliken charges with hydrogens summed into heavy atoms:
elementType: Br O C C C C C C C C C C C C C C C C C C C C
charge: 0.001990 -0.074593 0.369775 0.275119 0.263209 -0.554454 0.448264 -0.094210 -0.104429 -0.132266 -0.142990 -0.168147 -0.097947 -0.109799 -0.129765 0.280349 -0.000178 -0.001190 -0.017326 -0.002670 0.002026 -0.010767
polarizability: 3.42417340e+02 -6.89534303e-02 2.54177844e+02 1.20563828e+01 3.96036407e+00 1.59505015e+02
1716.lowfreq: -5.5958 -0.0007 -0.0004 0.0005 2.3967 4.9198 27.4484 36.2420 49.2191
frequency: 27.4187 36.1588 49.2119 54.0517 59.8902 69.7470 80.1751 115.9510 151.2655 180.1251 201.3446 231.9572 236.1301 257.1270 283.7278 340.8095 369.1144 386.9501 401.7574 404.1500 412.7343 427.6361 480.4344 503.0833 531.8993 541.5542 605.2848 612.0747 617.4301 619.5230 628.7536 668.2156 695.6303 702.4818 725.8854 736.1767 773.9251 788.8856 795.8233 807.3323 832.4465 842.3401 850.6917 854.5646 919.9437 928.5324 937.2071 951.8900 965.6692 979.0811 980.0216 987.7459 989.0696 996.2206 996.3954 1004.9157 1026.7219 1029.0259 1082.4355 1085.2043 1103.5127 1142.2519 1149.3006 1172.3282 1173.0873 1182.8438 1190.8418 1192.6193 1234.5530 1250.3001 1278.2767 1312.2406 1315.6693 1319.1769 1370.0920 1373.5227 1380.0668 1422.5926 1431.4543 1432.5717 1472.6302 1477.7629 1500.8223 1570.5647 1578.8470 1584.8709 1588.1080 1603.0273 1605.8200 1621.8971 3114.5394 3124.1903 3126.2044 3132.0486 3134.6848 3142.9744 3144.6080 3147.3574 3153.8258 3155.8642 3158.5032 3166.3331 3167.6309 3173.3484 3580.2770
redmass: 7.6984 4.8805 5.8953 4.2177 4.4220 3.7342 6.1787 6.8862 7.5221 6.3804 5.8037 5.3155 8.1348 5.7471 4.7573 5.6894 1.1201 4.4758 2.8526 2.8754 2.9768 4.3971 4.2388 3.7659 3.6860 5.1424 5.1371 6.1803 6.3297 6.8227 6.7454 5.6244 1.9275 1.7926 3.1714 3.2497 1.9191 2.6683 5.7181 1.4124 2.1247 2.7018 1.2618 1.2576 1.9789 1.4142 1.7947 1.8572 1.3654 1.4282 1.3960 5.5715 5.7282 1.3216 1.3207 2.7458 2.2790 2.0906 1.6127 1.6115 1.4723 1.7247 2.1431 1.0533 1.0531 1.1153 1.1134 1.1228 3.6228 2.5761 3.7348 1.4126 1.3511 1.4403 6.4913 5.5877 4.7402 3.5065 2.3078 2.3069 2.2005 2.2500 2.7549 7.4734 5.8841 6.7526 6.9405 5.9946 6.1784 6.3756 1.0895 1.0846 1.0846 1.0879 1.0879 1.0891 1.0927 1.0925 1.0961 1.0964 1.0946 1.1013 1.1015 1.0962 1.0660
irintensity: 0.1906 0.2499 0.3767 0.1099 0.5666 0.4697 0.3246 0.2020 0.2090 0.9804 0.2913 0.5892 2.4909 1.6490 0.5841 0.6566 139.0275 14.0775 0.5199 0.6225 1.4225 4.8436 1.8871 10.4068 8.9824 33.1005 34.5780 1.7340 1.9482 16.2393 0.7667 3.5299 37.0727 44.4477 41.2549 54.1347 14.8459 58.4493 5.8983 18.5020 10.2345 32.3932 0.7478 0.7317 8.4308 1.1039 10.2941 7.5275 0.9020 0.0950 0.4722 0.7862 0.6674 0.7134 0.2699 6.1457 8.2978 7.7332 1.4123 13.6308 60.3340 158.3526 130.4995 0.0135 0.0685 18.3890 1.2555 0.4372 16.9114 45.7098 25.5510 3.3905 2.6757 4.5441 3.9507 7.8330 22.1945 6.5273 2.2418 18.3256 2.2516 14.7577 95.5006 7.1980 3.3693 6.2384 26.6200 0.8824 6.7774 80.1882 23.2615 1.3549 1.3244 2.3092 3.6799 7.2883 19.8273 17.6014 30.8079 26.1680 6.3113 20.8850 23.1509 6.3479 59.2391
temp: 298.150 k
press: 1.00000 atm
elementType: 35 8 6 6 6 6 6 6 6 6 6 6 6 6 6 6 6 6 6 6 6 6 1 1 1 1 1 1 1 1 1 1 1 1 1 1 1
symmnumber: 1
zpe: 744711.2 jmol-1
zpe.correction: 0.283646 hartree
zpe.thermalcorrener: 0.302618 hartree
zpe.thermalcorrenthalpy: 0.303562 hartree
zpe.thermalcorrgfe: 0.234096 hartree
zpe.sumelectzpe: -858.288924 hartree
zpe.sumelectthermal: -858.269951 hartree
zpe.sumelectthermalent: -858.269007 hartree
zpe.sumelectthermalfe: -858.338473 hartree
dipole: -0.7631 1.2150 1.6037
dipole: 2.1518
quadrupole: -121.2170 -132.0649 -130.1018
quadrupole: -7.6142 11.5825 -1.0082
quadrupole: 6.5776 -4.2703 -2.3072 -7.6142 11.5825 -1.0082
hfenergy: -858.5725692 hartree
pointgroup: C01 [X(C20H15Br1O1)]
dipole: -0.378582 0.3866029 0.6511132 debye
polarizability: 339.4659531|3.8600552|252.5453327|24.5063727|14.9595741|164.0889136 unknown
InChI: InChI=1S/C20H15BrO/c21-20(17-9-5-2-6-10-17)19(15-7-3-1-4-8-15)16-11-13-18(22)14-12-16/h1-14,22H
charge 0 multiplicity 1
37 atoms
Br 0.343971 -3.053215 -0.770376
O  6.003493 -0.185591 0.513711
C  0.299092 -0.185508 -0.137298
C  1.783372 -0.230243 0.033438
C  -0.318444 1.186782 -0.118621
C  -0.497253 -1.292718 -0.330085
C  -1.974931 -1.379126 -0.217765
C  2.397187 -1.097212 0.975872
C  2.619003 0.65108 -0.709001
C  -1.277144 1.581639 -1.091632
C  0.096351 2.140883 0.851585
C  3.794033 -1.101544 1.16098
C  4.015951 0.648815 -0.545524
C  -2.770892 -2.055872 -1.182651
C  -2.62282 -0.787262 0.904496
C  4.60482 -0.232171 0.390956
C  -1.820515 2.883252 -1.081456
C  -0.453858 3.440516 0.866648
C  -1.416803 3.817626 -0.098731
C  -4.173089 -2.115319 -1.044699
C  -4.024484 -0.851856 1.042551
C  -4.807733 -1.512432 0.067274
H  1.775262 -1.769179 1.575206
H  2.16444 1.339646 -1.429239
H  -1.584758 0.866202 -1.861185
H  0.850642 1.857729 1.593976
H  4.246671 -1.775058 1.900543
H  4.660987 1.314065 -1.1266
H  -2.284479 -2.536586 -2.038179
H  -2.019021 -0.280219 1.663984
H  -2.553875 3.170666 -1.843151
H  -0.129133 4.159146 1.627528
H  -1.83947 4.828591 -0.091287
H  -4.77069 -2.634926 -1.80192
H  -4.504472 -0.393021 1.914097
H  -5.896674 -1.565371 0.176778
H  6.321862 -0.844707 1.179478
