program: Gaussian 09
title: 000013752
version: EM64L-G09RevD.01
frameworkgroup: C1[X(C10H8N4O3S2)]
method: RPBEPBE
basis: SDD
operation: Freq
keyword: #p
keyword: freq=noraman
keyword: PBEPBE/SDD
title: #p freq=noraman PBEPBE/SDD
converged: YES YES NO NO
title: Mulliken charges:
elementType: S S O O O N N N N C C C C C C C C C C H H H H H H H H
charge: 0.369572 0.155849 -0.183292 -0.198539 -0.197672 -0.037611 0.012141 -0.064033 0.025443 -0.664906 0.314483 -0.524435 -0.601515 0.153815 -0.304410 -0.239621 0.388627 -0.333956 -0.330363 0.322788 0.266212 0.264902 0.262739 0.269239 0.288198 0.294410 0.291932
chargesum: 0.00000
title: Mulliken charges with hydrogens summed into heavy atoms:
elementType: S S O O O N N N N C C C C C C C C C C
charge: 0.369572 0.155849 -0.183292 -0.198539 -0.197672 -0.037611 0.012141 -0.064033 0.025443 -0.342117 0.314483 -0.524435 0.192338 0.153815 -0.035170 0.048576 0.388627 -0.039546 -0.038431
polarizability: 3.92543164e+02 3.51397489e+01 1.52016586e+02 -8.63520839e+00 -1.52227405e+01 1.32547182e+02
1716.lowfreq: -12.7404 -4.2328 -0.0009 0.0008 0.0027 1.0859 18.7070 22.2728 30.7473
frequency: 17.9667 22.1830 30.7056 61.2307 67.4069 81.6498 96.5064 104.7104 163.8765 174.3958 216.0476 231.8128 242.8715 294.7955 312.7581 327.8147 357.3127 382.1175 398.8575 412.7829 459.0131 485.3354 501.7582 515.3033 519.9677 539.8402 590.8877 620.9232 662.6709 670.1675 719.7081 726.5129 751.7224 780.9789 829.5403 855.8531 857.7906 889.3006 954.0704 977.6571 998.4001 998.9647 1010.1973 1068.5129 1088.4225 1104.8989 1115.1568 1126.3790 1148.9039 1181.9156 1188.2796 1215.3499 1265.9039 1282.6407 1287.8493 1307.0263 1364.9014 1380.2435 1408.3658 1422.4581 1432.7557 1463.7959 1464.3551 1475.3333 1589.3193 1603.1146 1642.7611 3010.6479 3042.3342 3109.3017 3132.2351 3168.4728 3170.6454 3188.7367 3192.4968
redmass: 5.8839 14.6479 7.2786 9.2766 7.2665 11.1135 6.8409 1.0272 10.9338 9.4693 6.9576 6.3525 8.8701 6.7987 6.0948 5.4668 7.6450 9.6724 14.5248 3.0457 7.7702 10.0482 12.7293 4.2369 6.1397 8.8111 6.0899 7.1664 5.0095 5.6306 7.0560 6.4794 4.9092 7.9158 5.0321 1.3014 4.6688 1.6702 4.6679 7.7768 1.9772 1.7348 1.3557 7.6867 3.4059 1.2650 2.1416 1.3173 1.5794 1.2999 2.3667 6.4984 1.3803 4.1235 1.3319 6.3175 7.6773 11.7559 10.5851 4.1430 1.2384 1.0434 2.3417 1.0657 7.5947 6.7906 11.4104 1.0321 1.0843 1.1025 1.1029 1.0900 1.0888 1.0964 1.0969
irintensity: 0.0292 0.0557 0.3001 1.2280 1.4617 2.7541 5.0944 0.1359 1.7567 2.6864 1.1107 4.4985 6.1431 1.7910 14.0034 1.4408 1.0585 1.2317 15.9682 0.4527 25.4521 3.6683 1.2722 4.5302 1.7775 3.1955 8.7477 0.2243 16.2296 11.7586 8.9167 20.8392 7.2570 36.1521 10.4247 2.8882 17.8629 72.0239 34.6128 24.0564 4.3022 3.3339 0.1265 4.3684 20.1937 10.6133 212.5093 0.2842 6.2665 46.7184 90.8635 339.0096 5.2855 293.1379 19.9335 114.6122 70.7927 42.1969 3.5125 49.2671 81.5987 21.2563 2.8372 40.9878 2.6062 12.3632 218.2492 11.6417 12.6178 10.3258 0.5665 1.3622 1.6861 0.5141 0.8806
temp: 298.150 k
press: 1.00000 atm
elementType: 16 16 8 8 8 7 7 7 7 6 6 6 6 6 6 6 6 6 6 1 1 1 1 1 1 1 1
symmnumber: 1
zpe: 463899.1 jmol-1
zpe.correction: 0.176690 hartree
zpe.thermalcorrener: 0.194357 hartree
zpe.thermalcorrenthalpy: 0.195302 hartree
zpe.thermalcorrgfe: 0.127194 hartree
zpe.sumelectzpe: -1625.185145 hartree
zpe.sumelectthermal: -1625.167478 hartree
zpe.sumelectthermalent: -1625.166533 hartree
zpe.sumelectthermalfe: -1625.234641 hartree
dipole: -3.3291 1.6322 -0.4783
dipole: 3.7384
quadrupole: -156.3121 -130.1061 -119.7562
quadrupole: -0.8354 -13.1423 -5.1410
quadrupole: -20.9206 5.2854 15.6353 -0.8354 -13.1423 -5.1410
hfenergy: -1625.3618351 hartree
pointgroup: C01 [X(C10H8N4O3S2)]
dipole: -1.3625973 -0.0067413 -0.5536316 debye
polarizability: 384.602615|-0.8202597|126.2998819|-55.6707015|8.8201191|166.2044348 unknown
InChI: InChI=1S/C10H8N4O3S2/c1-13-9(15)8(19-10(13)18)12-11-6-2-4-7(5-3-6)14(16)17/h2-5,8H,1H3
charge 0 multiplicity 1
27 atoms
S  -3.252682 -1.666244 0.798304
S  -5.653435 -0.516012 2.35823
O  -2.998465 1.611915 -1.445174
O  6.225341 -0.286393 -0.41667
O  5.650916 0.794481 1.509317
N  -4.286024 0.747137 0.332217
N  -1.043516 -0.245193 -0.054305
N  -0.140836 -0.746351 -0.846091
N  5.355134 0.164434 0.422634
C  -2.411996 -0.591321 -0.523568
C  -3.242868 0.702354 -0.621357
C  -4.474327 -0.354615 1.175381
C  -5.16262 1.931601 0.418669
C  1.216096 -0.468819 -0.447676
C  2.205861 -0.947624 -1.343933
C  1.586841 0.220571 0.741755
C  3.915477 -0.056533 0.117655
C  3.569973 -0.741524 -1.067055
C  2.944855 0.427322 1.027735
H  -2.402048 -1.124288 -1.491165
H  -4.812765 2.656101 -0.332815
H  -5.103846 2.365131 1.430295
H  -6.207199 1.641862 0.219226
H  1.880862 -1.473536 -2.246562
H  0.803297 0.577616 1.415934
H  4.357929 -1.095203 -1.736228
H  3.273241 0.950031 1.929744
