program: Gaussian 09
title: 000154381
version: EM64L-G09RevD.01
frameworkgroup: C1[X(C12H22O2)]
method: RPBEPBE
basis: SDD
operation: Freq
keyword: #pfreq=noraman
keyword: PBEPBE/SDD
title: #p freq=noraman PBEPBE/SDD
converged: YES YES NO NO
title: Mulliken charges:
elementType: O O C C C C C C C C C C C C H H H H H H H H H H H H H H H H H H H H H H
charge: -0.260222 -0.250162 -0.364280 -0.348733 -0.390113 -0.354827 -0.281059 -0.694141 -0.269335 0.260644 -0.706272 -0.162041 -0.172849 -0.735834 0.190639 0.191369 0.189846 0.189907 0.211414 0.209275 0.195762 0.195618 0.225742 0.224089 0.216720 0.210156 0.210221 0.235197 0.229643 0.221395 0.237348 0.252281 0.219576 0.223928 0.222823 0.226277
chargesum: 0.00000
title: Mulliken charges with hydrogens summed into heavy atoms:
elementType: O O C C C C C C C C C C C C
charge: -0.260222 -0.250162 0.017727 0.031020 0.030575 0.036553 0.168772 -0.057044 -0.034139 0.260644 -0.017887 0.090240 0.046727 -0.062805
polarizability: 1.71204055e+02 6.89842677e+00 1.37053523e+02 7.45220039e-01 -4.95615005e+00 1.14165689e+02
1716.lowfreq: -16.2832 -2.2156 0.0003 0.0006 0.0007 4.4345 6.7973 23.4235 40.8459
frequency: -9.2123 22.3122 40.6692 48.4300 64.4968 71.2321 103.6542 120.5474 128.5218 141.8366 167.3501 187.5072 201.3829 207.6003 220.1343 226.3697 248.8625 273.8879 317.0430 359.0117 417.7665 427.2795 455.0489 523.7943 675.5410 708.7895 724.1348 744.8105 793.6540 804.3463 841.6368 875.0720 880.9284 889.8893 919.6214 962.8052 977.6735 985.3624 1010.8317 1042.9490 1044.6998 1051.0010 1054.4423 1070.5509 1083.9386 1103.6388 1114.6588 1126.9971 1147.6371 1158.5718 1195.0089 1238.1021 1241.9854 1246.4803 1273.7272 1286.3176 1289.3098 1291.2939 1292.0470 1308.7519 1329.3212 1339.9202 1356.9710 1371.7516 1384.0758 1388.3427 1394.4986 1462.1078 1463.5770 1465.9072 1469.9506 1470.6223 1471.8686 1476.1304 1476.9621 1478.3313 1484.8199 1490.1441 1631.5147 1685.6584 2954.2711 2958.9523 2967.1700 2968.8705 2972.1040 2987.9375 2989.2485 2991.0285 3000.5672 3007.5181 3030.0773 3041.2975 3044.3882 3045.1448 3068.4895 3071.8072 3071.8346 3074.5774 3086.3948 3089.5415 3096.5483 3100.9038
redmass: 3.0149 3.3107 2.1130 3.6935 2.5178 3.6207 1.7909 2.5508 2.1069 2.0702 2.3872 3.1506 2.0293 1.9353 1.1423 1.1225 3.2547 3.4239 4.1964 3.3740 3.2082 3.3996 3.0339 3.3243 3.6598 5.2152 1.0667 1.0931 1.1613 1.9286 3.5428 2.2894 1.2083 1.8169 3.0196 1.6594 1.0918 1.1475 3.8479 2.2281 1.5534 2.5086 2.6810 2.6868 2.1453 2.2783 3.4232 2.8104 1.4624 2.2660 1.5251 1.2851 1.2978 1.3117 1.1201 1.2359 1.1014 1.2300 1.1440 1.4726 1.3599 1.4497 1.6214 1.5771 1.2062 1.2171 1.2388 1.0473 1.0730 1.0733 1.0749 1.0527 1.0515 1.0570 1.0568 1.0547 1.0803 1.0950 9.5622 6.2205 1.0588 1.0590 1.0366 1.0591 1.0363 1.0349 1.0596 1.0979 1.0566 1.1015 1.1038 1.0970 1.0853 1.1043 1.1010 1.0990 1.0934 1.1077 1.0995 1.0980 1.0923 1.0974
irintensity: 0.0108 1.2915 0.1174 0.2635 0.0662 0.7897 0.2659 0.4571 0.0402 0.7332 0.7452 5.1070 2.0389 0.0289 0.2866 0.0083 4.7399 7.2195 2.9147 1.9004 10.3510 2.2424 0.4980 1.7240 2.4715 3.4760 12.2179 0.1251 1.6715 1.5326 10.5669 8.6385 1.3452 5.8043 20.0085 13.0379 49.5916 0.1434 1.4560 31.6023 1.7006 33.6241 38.7788 35.9835 31.6612 117.9873 235.6793 1.5858 2.0739 4.7467 0.0229 3.3517 0.6958 14.2601 0.0618 2.8426 0.0991 1.3847 1.0834 53.4963 23.1170 3.3146 0.4794 3.4482 18.8502 11.3386 12.8222 14.7055 0.0204 0.0523 4.0132 5.5470 21.9044 6.2248 6.1443 11.0453 3.0716 26.5319 175.8214 3.2572 0.0277 8.1739 39.1479 88.4793 35.7576 29.2393 19.5521 0.3682 41.5375 0.6984 31.1340 26.8896 5.3541 22.0225 65.5758 53.1577 2.9491 94.5790 25.4759 16.9649 35.5577 44.8248
temp: 298.150 k
press: 1.00000 atm
elementType: 8 8 6 6 6 6 6 6 6 6 6 6 6 6 1 1 1 1 1 1 1 1 1 1 1 1 1 1 1 1 1 1 1 1 1 1
symmnumber: 1
zpe: 826279.2 jmol-1
zpe.correction: 0.314713 hartree
zpe.thermalcorrener: 0.332158 hartree
zpe.thermalcorrenthalpy: 0.333102 hartree
zpe.thermalcorrgfe: 0.267464 hartree
zpe.sumelectzpe: -619.772220 hartree
zpe.sumelectthermal: -619.754775 hartree
zpe.sumelectthermalent: -619.753831 hartree
zpe.sumelectthermalfe: -619.819469 hartree
dipole: -0.9285 1.3742 -1.2739
dipole: 2.0913
quadrupole: -80.6041 -87.0478 -90.0415
quadrupole: 5.4085 -4.0195 4.0038
quadrupole: 5.2937 -1.1500 -4.1437 5.4085 -4.0195 4.0038
hfenergy: -620.0869332 hartree
pointgroup: C01 [X(C12H22O2)]
dipole: -0.3316576 -0.1598386 -0.7357987 debye
polarizability: 172.0769871|1.0645124|114.9703209|-3.9236285|-6.5324101|135.3759588 unknown
InChI: InChI=1S/C12H22O2/c1-4-6-7-8-10-14-12(13)11(3)9-5-2/h5,9,11H,4,6-8,10H2,1-3H3
charge 0 multiplicity 1
36 atoms
O  0.434853 -0.610611 0.401477
O  1.576076 0.169709 2.278525
C  -3.270869 0.362448 0.330716
C  -4.432677 -0.019902 -0.613819
C  -1.933511 -0.306189 -0.066029
C  -5.77185 0.65302 -0.235797
C  -0.805018 0.066635 0.894857
C  -6.929378 0.259851 -1.178902
C  2.78605 -1.149417 0.561938
C  1.573098 -0.463144 1.196598
C  3.447542 -2.097213 1.598669
C  3.760851 -0.073463 0.096482
C  4.128421 0.120835 -1.195876
C  5.106022 1.172677 -1.669616
H  -3.536805 0.077082 1.3700
H  -3.148802 1.465697 0.331832
H  -4.166053 0.255976 -1.655459
H  -4.562941 -1.122233 -0.607995
H  -1.652025 -0.002948 -1.092861
H  -2.051519 -1.407044 -0.077099
H  -5.642331 1.754624 -0.246857
H  -6.034307 0.381788 0.807233
H  -1.002874 -0.271592 1.928949
H  -0.616937 1.156371 0.919522
H  -7.874728 0.753354 -0.887544
H  -6.705289 0.548573 -2.22327
H  -7.099987 -0.833238 -1.163136
H  2.432799 -1.726087 -0.310513
H  4.344511 -2.56635 1.158775
H  2.750488 -2.895865 1.911438
H  3.74851 -1.532069 2.49803
H  4.174632 0.564061 0.892409
H  3.692225 -0.526828 -1.972851
H  4.631008 1.856023 -2.400453
H  5.973422 0.711965 -2.181565
H  5.485393 1.779507 -0.828909
