program: Gaussian 09
title: 000154370
version: EM64L-G09RevD.01
frameworkgroup: C1[X(C10H5Cl3)]
method: RPBEPBE
basis: SDD
operation: Freq
keyword: #pfreq=noraman
keyword: PBEPBE/SDD
title: #p freq=noraman PBEPBE/SDD
converged: NO NO NO YES
title: Mulliken charges:
elementType: Cl Cl Cl C C C C C C C C C C H H H H H
charge: -0.000124 -0.000857 -0.042523 0.457922 0.431027 -0.278328 -0.436275 -0.340621 -0.404670 -0.120804 -0.231169 -0.112857 -0.231479 0.250902 0.285555 0.250308 0.262403 0.261590
chargesum: 0.00000
title: Mulliken charges with hydrogens summed into heavy atoms:
elementType: Cl Cl Cl C C C C C C C C C C
charge: -0.000124 -0.000857 -0.042523 0.457922 0.431027 -0.278328 -0.185372 -0.055066 -0.154362 -0.120804 0.031233 -0.112857 0.030111
polarizability: 2.23857668e+02 3.61650752e+00 1.49413946e+02 4.10494177e-03 1.03111261e-03 4.85874433e+01
1716.lowfreq: 0.0005 0.0025 0.0035 3.3186 5.3783 7.6195 58.0702 109.4929 140.2643
frequency: 58.0610 109.4923 140.2642 147.0184 196.2094 265.9711 274.4859 295.7615 310.9606 374.3917 413.1822 420.2567 476.3974 531.1436 549.5501 606.9885 621.4330 640.5110 667.5324 767.1959 790.2364 808.5950 845.8360 874.7071 894.8923 951.2027 953.2820 973.8569 1075.8168 1130.1663 1143.9122 1164.1941 1234.3950 1256.0123 1285.7210 1392.2546 1402.0018 1407.7601 1431.3043 1491.8431 1563.9219 1584.6676 1621.9834 3138.7690 3144.4018 3175.2678 3175.9365 3180.2177
redmass: 23.2323 5.4908 22.7783 6.2399 29.7840 5.3319 13.2087 5.9161 12.3089 10.9119 8.9179 3.2170 5.0457 3.6766 4.8181 7.6554 9.7078 4.2460 7.2628 3.2503 1.3063 5.8066 1.5936 6.9063 1.4951 6.6006 1.3144 1.3965 2.3486 1.9516 1.9530 1.3316 1.9830 1.5222 2.3840 4.0376 5.5417 3.5463 3.0300 3.8031 9.9455 6.4181 7.3425 1.0898 1.0892 1.0962 1.0965 1.0925
irintensity: 0.0213 0.0160 0.1090 0.7118 0.0018 0.2999 0.3785 2.1769 0.9821 10.3372 2.4214 6.6759 6.6768 17.2076 0.6876 0.4539 49.4187 0.0179 10.3041 5.0693 0.2210 7.4968 82.4354 10.0599 19.7687 84.6758 0.1662 2.7734 39.9821 24.2059 14.1024 26.2686 6.2204 14.9728 17.0915 5.5357 35.0176 1.7522 6.5108 74.4902 1.9817 17.0075 59.4212 3.8674 6.4209 1.4652 5.2482 3.3427
temp: 298.150 k
press: 1.00000 atm
elementType: 17 17 17 6 6 6 6 6 6 6 6 6 6 1 1 1 1 1
symmnumber: 1
zpe: 304808.3 jmol-1
zpe.correction: 0.116095 hartree
zpe.thermalcorrener: 0.126943 hartree
zpe.thermalcorrenthalpy: 0.127888 hartree
zpe.thermalcorrgfe: 0.078238 hartree
zpe.sumelectzpe: -1763.358776 hartree
zpe.sumelectthermal: -1763.347928 hartree
zpe.sumelectthermalent: -1763.346984 hartree
zpe.sumelectthermalfe: -1763.396634 hartree
dipole: -0.3863 3.4590 0.0001
dipole: 3.4805
quadrupole: -99.1679 -84.5751 -98.8786
quadrupole: -0.5180 -0.0002 0.0002
quadrupole: -4.9607 9.6321 -4.6714 -0.5180 -0.0002 0.0002
hfenergy: -1763.4748711 hartree
pointgroup: C01 [X(C10H5Cl3)]
dipole: 0.1435029 1.3618078 -0.0000203 debye
dipolederiv: -0.0693199 -0.0375749 -0.0000011 -0.1531957 -0.6674451 -0.0000008 0. 0.0000069 -0.0227897 -0.7805296 -0.1669944 -0.0000146 -0.2796114 -0.1210456 -0.0000058 -0.0000107 -0.0000032 -0.0290004 -0.7550652 0.2652196 -0.0000177 0.4281238 -0.2972331 0.000013 -0.0000072 0.0000051 -0.0616302 0.2594368 -0.0773008 0.0000091 -0.1225973 -0.2360982 -0.0000029 0.0000088 0.0000006 0.0565908 -0.0462486 -0.0555986 -0.0000022 0.0208882 -0.1065887 0.0000009 -0.0000059 -0.0000008 0.0462128 -0.251809 0.120846 -0.0000033 0.1726944 0.9589833 0.0000006 -0.0000005 -0.0000086 -0.0688338 0.1150498 0.0254488 0.0000064 -0.0998464 0.096472 -0.0000054 0.0000066 -0.0000047 -0.1620092 -0.4638784 0.1269185 -0.0000079 0.0445604 -0.0961167 0.0000044 -0.0000067 0.0000097 -0.1107562 0.1412041 -0.0182962 0.0000068 0.0912838 0.1069301 -0.0000004 0.0000106 -0.0000032 -0.1509646 1.0871248 0.2531269 0.0000201 0.4440779 0.0141268 0.0000081 0.0000145 0.0000076 -0.0402784 -0.2947737 -0.0937253 -0.0000049 -0.1476607 -0.0095073 -0.0000018 -0.000006 -0.0000007 -0.1078683 1.0873748 -0.4969327 0.0000292 -0.6260058 0.4755081 -0.0000207 0.0000206 -0.0000167 -0.0606967 -0.2523634 0.2004511 -0.0000121 0.2205691 -0.1186458 0.0000029 -0.0000148 0.0000006 -0.1105065 0.0630623 -0.055576 -0.0000017 0.0064807 -0.0753772 0.0000024 -0.0000019 0.0000014 0.1616561 0.1158211 -0.0211818 -0.0000026 0.0261669 0.0278938 0.0000005 -0.0000047 -0.0000034 0.1694484 0.0642685 0.0298714 -0.0000011 -0.0286378 -0.0847177 0.0000022 0.0000003 0.0000059 0.1565817 0.0010333 0.0639582 -0.0000027 0.0443467 0.0502899 0.0000013 -0.000002 0.0000009 0.1667402 -0.0203877 -0.0626599 0.0000003 -0.0416368 0.0825716 0.0000017 -0.0000009 0.0000026 0.1681039 unknown
polarizability: 223.8998585|-3.152221|149.3717548|0.0041113|-0.0010055|48.5874433 unknown
InChI: InChI=1S/C10H5Cl3/c11-7-3-1-6-2-4-9(12)10(13)8(6)5-7/h1-5H
charge 0 multiplicity 1
18 atoms
Cl -1.400997 -2.647102 -0.000046
Cl -4.035524 -0.733418 -0.000107
Cl 4.033991 -1.425015 0.000094
C  0.08602 -0.260967 -0.000019
C  0.195256 1.187568 -0.00002
C  -1.231902 -0.840209 -0.000057
C  -0.993248 1.986435 -0.000061
C  1.280849 -1.052329 0.000037
C  1.499452 1.782118 0.000002
C  -2.367622 -0.02929 -0.000083
C  -2.253277 1.393648 -0.000084
C  2.518814 -0.418069 0.000061
C  2.654965 1.001104 0.000022
H  -0.904671 3.078055 -0.00007
H  1.209821 -2.142493 0.000031
H  1.582091 2.87479 -0.000012
H  -3.166115 1.995557 -0.000098
H  3.649196 1.456217 0.000009
