program: Gaussian 09
title: 000154365
version: EM64L-G09RevD.01
frameworkgroup: C1[X(C14H16O3)]
method: RPBEPBE
basis: SDD
operation: Freq
keyword: #pfreq=noraman
keyword: PBEPBE/SDD
title: #p freq=noraman PBEPBE/SDD
converged: YES YES NO NO
title: Mulliken charges:
elementType: O O O C C C C C C C C C C C C C C H H H H H H H H H H H H H H H H
charge: -0.423686 -0.435815 -0.262988 0.397027 -0.611997 -0.546073 0.138502 -0.295341 0.528850 0.393339 -0.395757 -0.398311 -0.787075 -0.794934 -0.286411 -0.319407 0.148366 0.213524 0.227843 0.239438 0.226299 0.220813 0.240013 0.228353 0.215581 0.217769 0.243933 0.213650 0.218562 0.262658 0.360876 0.247382 0.375013
chargesum: 0.00000
title: Mulliken charges with hydrogens summed into heavy atoms:
elementType: O O O C C C C C C C C C C C C C C
charge: -0.062810 -0.060802 -0.262988 0.397027 -0.170629 -0.306635 0.138502 -0.069042 0.528850 0.393339 -0.174944 -0.158298 -0.125371 -0.118788 -0.023753 -0.072025 0.148366
polarizability: 3.06397960e+02 3.32477259e+01 1.66486595e+02 -3.36552863e+00 1.50490232e+01 9.91680021e+01
1716.lowfreq: -2.3619 -0.0002 0.0001 0.0004 4.0567 5.5315 23.9546 37.4612 46.5278
frequency: 23.4026 37.3492 46.3495 65.0590 73.4781 80.9466 126.7222 141.5423 168.9933 174.6808 195.3804 228.7186 238.6017 277.1063 301.0140 330.1806 372.5648 385.8149 395.6054 425.4175 440.7808 462.9872 501.8878 505.0535 520.6546 567.9402 587.6541 605.9653 624.8328 693.3174 735.2375 755.7271 763.8523 784.0616 809.1166 858.1171 879.6478 913.5316 923.3842 931.4784 937.5006 951.1737 974.2068 995.2316 1011.6994 1016.8963 1050.6495 1083.4021 1086.9141 1109.7334 1154.7306 1163.4607 1178.6891 1219.2633 1231.7899 1244.9491 1258.0688 1288.3869 1298.1001 1320.9913 1347.6915 1358.1221 1388.7764 1398.7144 1401.1169 1437.8765 1453.0114 1458.3924 1468.0392 1471.0271 1482.1110 1497.3780 1592.6208 1606.1475 1630.9961 1647.0510 1693.5395 2958.2163 2966.3623 2982.5324 3029.8490 3034.5443 3068.6202 3079.2521 3088.0012 3098.4399 3106.0726 3114.3963 3133.0562 3145.4901 3164.1620 3525.8613 3576.9897
redmass: 4.0573 5.6481 3.6379 4.3325 4.9328 4.8549 1.1332 3.3794 1.4595 4.6870 2.3750 2.6969 5.0564 4.2198 4.3697 2.2898 2.2522 1.2384 3.0047 3.3710 2.5276 3.1353 5.6870 2.8629 3.5487 1.7058 2.6661 4.6345 3.0083 4.2340 4.0469 4.0868 3.3370 2.9102 1.4956 1.6140 1.8173 1.7861 2.4939 3.2664 1.3631 1.3705 2.6369 1.2541 1.2287 2.1605 2.1281 1.6825 2.2227 1.9857 1.3111 1.7017 1.2605 1.5510 1.6626 1.7178 3.2450 1.4028 1.4996 1.4090 2.7335 1.4173 1.2943 1.2410 4.5939 4.0383 1.0669 1.0780 1.0791 1.0579 1.1047 2.5289 6.2609 6.5966 7.7065 5.6957 6.3935 1.0373 1.0395 1.0664 1.0969 1.0962 1.0909 1.0983 1.0917 1.0897 1.0952 1.0883 1.0910 1.0962 1.0917 1.0640 1.0660
irintensity: 0.0486 0.6087 0.5047 0.8979 0.8737 0.4977 0.2921 1.8177 1.1524 1.0080 0.0427 2.7044 0.5249 1.1319 2.9633 4.2754 24.7992 102.8016 2.1490 0.0996 3.5113 4.5232 73.5935 15.5434 11.2823 61.4443 46.6428 12.4513 44.1492 19.2628 0.6226 2.1630 3.1353 5.9169 55.0335 26.9019 11.2895 13.9936 32.8809 16.2380 1.5682 0.9658 6.6873 6.4340 45.6095 1.7841 694.7743 7.1767 75.1595 12.9874 48.8897 10.0895 4.1109 37.4929 3.7774 11.5194 184.6188 1.4201 14.0650 23.2297 63.9499 7.6904 29.9908 14.5460 1.3520 3.3579 2.9634 2.7205 37.1828 16.0593 11.8533 129.2259 5.7549 463.4130 295.0819 130.6831 5.3909 39.6690 63.4615 27.9863 10.7577 43.3697 2.5688 16.5274 35.8357 2.6870 31.5614 16.7619 8.0064 10.4108 10.2877 55.1661 69.9157
temp: 298.150 k
press: 1.00000 atm
elementType: 8 8 8 6 6 6 6 6 6 6 6 6 6 6 6 6 6 1 1 1 1 1 1 1 1 1 1 1 1 1 1 1 1
symmnumber: 1
zpe: 693442.0 jmol-1
zpe.correction: 0.264118 hartree
zpe.thermalcorrener: 0.281804 hartree
zpe.thermalcorrenthalpy: 0.282749 hartree
zpe.thermalcorrgfe: 0.216860 hartree
zpe.sumelectzpe: -767.494885 hartree
zpe.sumelectthermal: -767.477198 hartree
zpe.sumelectthermalent: -767.476254 hartree
zpe.sumelectthermalfe: -767.542143 hartree
dipole: 4.0322 1.6015 0.1128
dipole: 4.3401
quadrupole: -107.0883 -87.0194 -103.2110
quadrupole: 10.3115 4.7207 3.1773
quadrupole: -7.9821 12.0869 -4.1047 10.3115 4.7207 3.1773
hfenergy: -767.7590027 hartree
pointgroup: C01 [X(C14H16O3)]
dipole: -1.5845061 -0.6313381 0.0797046 debye
polarizability: 306.2402822|33.6524131|165.1233737|1.0600702|-18.2194977|100.6889015 unknown
InChI: InChI=1S/C14H16O3/c1-10(2)3-6-12-9-11(4-7-13(12)15)5-8-14(16)17/h3-5,7-9,15-16H,6H2,1-2H3
charge 0 multiplicity 1
33 atoms
O  -2.692193 -2.021621 -0.157066
O  5.208641 2.162684 -0.521335
O  5.641282 0.136427 0.543662
C  -0.977415 -0.376838 -0.546978
C  -2.030273 0.548873 -1.145788
C  0.373531 0.002863 -0.45204
C  -1.343992 -1.654485 -0.029275
C  -2.73452 1.374611 -0.075377
C  1.366042 -0.831325 0.145096
C  -4.066692 1.404249 0.21561
C  -0.386379 -2.507071 0.568791
C  0.955132 -2.094378 0.656517
C  -4.59579 2.313263 1.314828
C  -5.12634 0.577836 -0.490941
C  2.775629 -0.4561 0.251157
C  3.368891 0.700795 -0.185215
C  4.810737 0.912903 0.002284
H  -1.527511 1.235277 -1.856197
H  -2.761777 -0.040562 -1.722484
H  0.662074 0.979626 -0.857692
H  -2.062845 2.012585 0.519646
H  -0.687143 -3.487475 0.96044
H  1.697139 -2.754834 1.120039
H  -3.792082 2.913091 1.776012
H  -5.362196 3.010333 0.920674
H  -5.086933 1.722675 2.11395
H  -4.699747 -0.186958 -1.158134
H  -5.76393 0.057907 0.250819
H  -5.798294 1.227981 -1.086609
H  3.440414 -1.186485 0.736455
H  -2.855407 -2.915269 0.235393
H  2.821065 1.505577 -0.683898
H  6.187581 2.266446 -0.376144
