program: Gaussian 09
title: 000154363
version: EM64L-G09RevD.01
frameworkgroup: C1[X(C19H20N2O2)]
method: RPBEPBE
basis: SDD
operation: Freq
keyword: #p
keyword: freq=noraman
keyword: PBEPBE/SDD
title: #p freq=noraman PBEPBE/SDD
converged: YES YES NO NO
title: Mulliken charges:
elementType: O O N N C C C C C C C C C C C C C C C C C C C H H H H H H H H H H H H H H H H H H H H
charge: -0.346161 -0.285276 -0.396458 -0.086911 0.072825 0.342034 0.141969 -0.329333 -0.390217 0.295648 -0.501047 0.149477 -0.428579 -0.367097 0.326736 -0.224379 -0.617163 -0.618232 -0.373063 -0.364768 -0.237326 -0.228288 -0.240509 0.254341 0.175608 0.210739 0.260235 0.260713 0.348580 0.249690 0.280258 0.231062 0.187045 0.226540 0.217599 0.186173 0.236343 0.219655 0.227128 0.240114 0.230512 0.229854 0.233932
chargesum: 0.00000
title: Mulliken charges with hydrogens summed into heavy atoms:
elementType: O O N N C C C C C C C C C C C C C C C C C C C
charge: -0.346161 -0.285276 -0.047878 -0.086911 0.072825 0.342034 0.141969 0.100615 0.080757 0.295648 -0.240335 0.149477 -0.178889 -0.086839 0.326736 0.006683 0.014021 0.023938 -0.145935 -0.124653 -0.006814 0.001567 -0.006577
polarizability: 2.87828514e+02 3.39029714e+01 3.40149295e+02 -1.31721922e+01 1.27529825e+01 1.13865650e+02
1716.lowfreq: -5.6107 -4.1307 0.0002 0.0006 0.0006 2.0391 9.6229 18.4075 26.6818
frequency: 9.1733 18.3301 26.5644 38.4165 56.6592 68.0750 74.0245 96.2833 128.6724 142.0468 177.9607 191.4771 217.2869 234.6610 247.7688 257.9987 274.5985 299.0543 316.6415 332.3957 350.5812 387.8862 398.5548 414.8807 430.2304 469.1539 494.7063 510.9095 534.4785 563.3744 590.6000 613.3536 625.1124 634.2413 645.2675 682.9305 692.2302 717.7837 739.4931 746.8775 773.5586 802.8902 805.7995 828.6763 840.0079 846.9151 849.1612 885.1560 922.1237 933.2308 960.2221 977.3937 987.0914 988.0568 991.4355 997.5287 1018.3417 1030.6989 1034.1489 1038.5296 1054.8631 1069.1388 1077.3290 1082.6518 1092.3805 1138.8728 1145.5862 1166.7814 1174.5459 1184.8891 1189.8816 1193.4096 1221.7952 1253.2486 1263.2566 1273.8326 1290.1698 1303.0037 1308.8969 1327.1473 1328.3797 1372.5490 1381.6039 1402.6907 1418.5099 1419.5655 1439.0434 1439.7396 1449.8808 1462.3902 1464.1752 1467.6855 1476.4728 1479.6898 1482.0174 1486.5237 1521.2103 1574.8767 1587.4674 1593.6007 1609.1190 1616.6115 1619.0622 2841.5918 2844.8914 2863.9976 3016.8512 3019.0540 3023.7186 3052.3435 3077.8169 3082.7314 3092.7294 3129.6853 3136.9660 3139.9463 3149.7114 3155.4611 3161.6714 3169.7074 3173.1769 3224.2283 3507.5563
redmass: 3.6375 3.8439 2.8352 5.0416 5.4630 4.4979 5.8716 2.3621 5.3669 4.3704 4.7272 2.5020 1.1440 1.8081 2.5597 2.9617 2.8316 6.0321 5.2194 6.2251 2.7207 3.4967 2.7833 2.7644 3.9142 4.2345 3.9690 4.5814 4.8712 3.6617 6.5517 6.4380 5.5807 1.2428 3.0606 5.2469 1.8455 5.3445 2.1383 2.5389 1.7089 1.6627 2.2992 3.8049 1.5741 4.0041 1.3674 8.3779 1.4557 1.3945 4.8943 1.3900 4.9310 6.2220 1.3388 1.3265 3.1553 1.9810 1.5932 2.5086 2.2940 2.6676 1.7500 1.6020 1.3527 1.4973 3.3427 1.3721 1.0805 1.4770 1.7881 1.1434 1.8940 3.2268 2.1330 2.0136 2.2465 1.1765 3.1604 1.4186 1.3753 1.3184 7.2469 2.7919 8.0406 1.1457 1.8005 1.3507 1.1501 1.0659 2.4232 1.0673 1.0533 1.0935 2.5547 1.0576 1.8115 5.9712 6.3169 7.1106 7.0506 7.1197 6.7410 1.0600 1.0643 1.0610 1.0626 1.0724 1.0700 1.0877 1.1006 1.1003 1.1041 1.0850 1.0880 1.0867 1.0934 1.0922 1.0960 1.0986 1.1002 1.0978 1.0797
irintensity: 0.4397 0.2839 0.4300 1.5708 1.0146 0.5192 6.3288 1.8190 1.1693 2.7314 0.2528 1.1769 1.7841 0.1600 0.7441 2.0894 2.7734 0.1320 1.7450 14.6017 10.2726 4.0144 0.0035 1.3006 0.3464 2.8330 16.4891 15.2835 4.5099 0.2904 1.5447 0.2500 2.4504 58.8897 19.9720 4.6344 49.8696 0.6216 11.3741 62.7061 60.1214 4.8551 7.6509 13.4516 40.3880 8.3496 19.7777 13.7611 4.0899 0.1542 1.2255 0.0050 35.7620 2.2305 1.9433 0.1193 13.2399 2.7914 26.4661 1.0842 43.9909 19.8577 18.5403 7.7428 9.7207 3.0197 48.8228 3.6371 0.4530 9.5258 12.5265 1.0851 4.7468 10.5769 13.5502 1.0914 114.8959 1.0454 4.2362 2.8289 5.0521 0.7845 2.6154 18.7385 12.2034 5.4524 9.8023 10.4367 14.5068 9.6692 23.3840 8.8088 25.8122 18.2526 9.1450 5.5911 209.6685 10.4403 111.7327 4.4040 7.8505 71.6386 11.9698 60.5211 79.8907 224.9409 13.4826 39.2592 75.6057 5.6672 24.5611 53.7280 16.4662 3.9785 0.9101 6.9638 21.5195 5.5269 34.6496 23.1048 14.2177 5.6494 89.4197
temp: 298.150 k
press: 1.00000 atm
elementType: 8 8 7 7 6 6 6 6 6 6 6 6 6 6 6 6 6 6 6 6 6 6 6 1 1 1 1 1 1 1 1 1 1 1 1 1 1 1 1 1 1 1 1
symmnumber: 1
zpe: 913528.8 jmol-1
zpe.correction: 0.347945 hartree
zpe.thermalcorrener: 0.369113 hartree
zpe.thermalcorrenthalpy: 0.370057 hartree
zpe.thermalcorrgfe: 0.294063 hartree
zpe.sumelectzpe: -994.321107 hartree
zpe.sumelectthermal: -994.299939 hartree
zpe.sumelectthermalent: -994.298995 hartree
zpe.sumelectthermalfe: -994.374988 hartree
dipole: -4.4244 -2.8565 1.3085
dipole: 5.4265
quadrupole: -125.3969 -120.2329 -142.3432
quadrupole: -11.7090 2.9424 3.9701
quadrupole: 3.9274 9.0915 -13.0189 -11.7090 2.9424 3.9701
hfenergy: -994.6690515 hartree
pointgroup: C01 [X(C19H20N2O2)]
dipole: 1.8154083 0.9984343 0.515269 debye
polarizability: 292.9105421|37.5274739|334.6900089|12.7805263|-15.4038926|114.2429074 unknown
InChI: InChI=1S/C19H20N2O2/c1-21(2)12-11-20-19(22)16-10-6-9-15-13-17(23-18(15)16)14-7-4-3-5-8-14/h3-10,13,20H,11-12H2,1-2H3
charge 0 multiplicity 1
43 atoms
O  0.887087 -0.332005 -0.032476
O  -3.194909 -1.960573 -0.456749
N  -1.885856 -0.03822 -0.539776
N  -4.923586 2.161033 0.1343
C  0.498004 -1.688728 0.071298
C  1.645225 -2.487229 0.349187
C  -0.808587 -2.197164 -0.071877
C  -3.81987 1.225663 0.439518
C  -3.027742 0.840449 -0.837376
C  2.305808 -0.29431 0.186851
C  2.773141 -1.578947 0.41635
C  -2.055202 -1.399067 -0.366211
C  1.48635 -3.888266 0.495142
C  -0.929429 -3.601862 0.082253
C  2.943124 1.019499 0.129974
C  0.189493 -4.428729 0.358216
C  -4.475894 3.555355 -0.045492
C  -6.050775 2.061083 1.082709
C  4.347658 1.141351 0.332709
C  2.184272 2.195915 -0.125205
C  4.97092 2.402902 0.28186
C  2.813148 3.456669 -0.175463
C  4.208182 3.568451 0.027598
H  -4.246617 0.294991 0.852918
H  -3.112845 1.637649 1.205272
H  -2.645095 1.741213 -1.349894
H  -3.715908 0.316118 -1.521317
H  3.807291 -1.85409 0.613381
H  -0.949123 0.361094 -0.437405
H  2.345168 -4.532848 0.708349
H  -1.935347 -4.021626 -0.023229
H  0.038889 -5.507882 0.466167
H  -4.057719 4.006301 0.891909
H  -5.326506 4.179057 -0.374373
H  -3.69851 3.614938 -0.827266
H  -5.789783 2.380584 2.12413
H  -6.410723 1.018394 1.123256
H  -6.885371 2.696494 0.733806
H  4.950735 0.248257 0.529834
H  1.104642 2.115084 -0.282123
H  6.05215 2.479921 0.439873
H  2.215227 4.353043 -0.372995
H  4.695484 4.548537 -0.011635
