program: Gaussian 09
title: 000154355
version: EM64L-G09RevD.01
frameworkgroup: C1[X(C18H19N3O)]
method: RPBEPBE
basis: SDD
operation: Freq
keyword: #p
keyword: freq=noraman
keyword: PBEPBE/SDD
title: #p freq=noraman PBEPBE/SDD
converged: YES YES NO NO
title: Mulliken charges:
elementType: O N N N C C C C C C C C C C C C C C C C C C H H H H H H H H H H H H H H H H H H H
charge: -0.302064 -0.086895 -0.371254 -0.133666 0.328422 -0.040090 0.256970 0.162275 -0.336388 -0.392892 0.334899 -0.388703 0.128063 -0.370074 -0.355385 -0.550749 -0.253793 -0.389988 -0.238325 -0.619270 -0.617595 -0.242076 0.176523 0.258189 0.250887 0.207282 0.224138 0.376112 0.289634 0.228782 0.257899 0.233782 0.237939 0.234064 0.236434 0.184517 0.217329 0.219312 0.223427 0.185396 0.236931
chargesum: 0.00000
title: Mulliken charges with hydrogens summed into heavy atoms:
elementType: O N N N C C C C C C C C C C C C C C C C C C
charge: -0.302064 -0.086895 0.004858 -0.133666 0.328422 -0.040090 0.256970 0.162275 0.098325 0.065277 0.334899 -0.164565 0.128063 -0.080440 -0.126603 -0.292850 -0.020011 -0.152049 -0.004261 0.019009 0.010541 -0.005145
polarizability: 3.35654254e+02 -3.03368646e+01 2.61369168e+02 1.58941706e+01 9.71511146e+00 1.10468324e+02
1716.lowfreq: -10.1678 -3.3926 -3.1160 -0.0006 -0.0003 0.0002 19.3735 30.5288 31.8768
frequency: 19.3345 29.9847 31.6488 58.9724 77.7587 94.5969 106.1162 127.1031 162.0559 184.9077 210.4944 219.5384 236.8745 237.6588 248.2745 273.9945 313.1445 340.5330 352.4824 395.9669 410.7482 416.1659 428.8170 463.4148 493.5450 497.7979 503.1298 549.8168 561.4351 562.2322 604.1078 630.6757 710.8654 716.1193 723.0004 752.4835 769.8137 783.0227 791.5516 816.5564 827.2315 842.8052 866.2764 876.2790 877.9461 905.6762 939.4058 947.5431 971.4626 997.8425 998.9826 1009.3231 1022.3804 1034.3526 1035.4909 1055.9120 1065.8206 1075.0186 1079.0684 1091.4506 1133.1833 1137.7896 1170.8484 1178.4975 1185.0121 1196.9349 1215.1785 1252.2793 1263.3202 1264.6669 1273.5201 1274.9690 1303.9837 1316.3039 1325.8229 1360.7872 1371.3239 1386.7075 1393.2069 1409.6591 1418.7610 1438.0158 1439.5057 1449.7334 1454.3611 1461.5875 1467.6366 1474.9097 1480.7171 1482.0141 1485.9498 1523.2800 1547.8822 1572.8573 1581.3602 1585.2695 1614.5367 1624.2972 2838.0997 2845.3836 2863.4485 3013.2904 3016.0228 3022.1075 3052.9074 3076.0046 3080.6885 3084.3321 3105.1804 3127.0798 3135.8238 3139.2999 3152.2365 3158.1044 3160.2839 3166.5060 3171.5464
redmass: 3.8224 3.2218 3.8119 6.2538 5.0123 2.4198 4.4857 3.5573 4.1724 2.8342 1.1305 2.3820 1.9875 3.5995 3.2137 3.0462 5.8841 7.0005 2.7742 3.1138 3.3289 2.7674 4.0982 4.1103 4.5947 3.2578 6.3877 5.4769 4.2048 7.2519 3.1788 6.5253 5.1091 4.4600 3.8152 2.4192 1.5921 1.6801 1.8433 5.2421 4.0536 2.2778 3.7078 4.7168 1.7334 1.1131 1.4568 1.3838 1.4492 1.3554 4.9540 1.3593 2.9501 1.9825 1.7537 2.9672 2.6124 2.1695 1.8336 1.3889 1.8214 1.5041 1.6789 1.1851 2.0425 1.9155 1.6250 1.9807 2.1455 1.7003 2.3186 1.8160 1.1643 3.1716 1.3361 3.0059 1.3218 2.1460 3.9786 3.7409 1.1399 2.8070 1.1992 1.3983 1.7997 1.0558 1.0557 1.0518 1.0880 3.2782 1.0609 4.0271 1.8320 6.7075 7.0821 5.3456 5.8765 6.3156 1.0580 1.0635 1.0643 1.0593 1.0722 1.0705 1.0892 1.1012 1.1002 1.1040 1.0911 1.0872 1.0868 1.0882 1.0925 1.0933 1.0866 1.0991 1.0984
irintensity: 0.5486 0.8351 0.2660 2.0599 1.6865 0.5639 2.9811 6.6118 1.0035 0.1426 1.3362 1.2201 1.3821 1.0446 1.6867 6.8224 1.1340 13.7393 12.1931 4.4947 0.6666 0.8506 4.2805 15.1663 16.1201 3.2158 10.4960 1.2000 0.7656 0.0612 0.9954 2.2297 13.4584 5.4166 10.3757 46.3026 39.1838 35.0147 1.9736 4.1554 9.7926 16.1805 5.7292 7.9874 1.5771 95.8780 1.1171 1.4741 4.3934 0.1764 8.0893 2.6810 16.5317 4.5659 24.0533 30.9386 33.2910 6.1292 12.6159 11.2474 1.8933 3.4694 7.3188 3.4397 8.4178 11.8029 1.5329 10.6590 17.0857 5.7701 20.2675 22.4937 5.0282 7.8517 1.4274 9.3103 0.5724 1.6427 1.1556 3.4973 4.0116 8.3775 10.3440 16.9902 19.2608 12.5457 9.6825 29.5890 12.8107 9.0292 10.4153 72.5816 372.3112 148.9711 4.1733 19.3820 68.0426 6.1618 74.6925 91.3642 211.1484 33.1542 43.5007 74.3748 1.7491 9.8869 64.2321 37.4705 18.0439 4.1689 5.3125 9.3350 4.5834 11.3809 614.4946 21.4980 17.1327
temp: 298.150 k
press: 1.00000 atm
elementType: 8 7 7 7 6 6 6 6 6 6 6 6 6 6 6 6 6 6 6 6 6 6 1 1 1 1 1 1 1 1 1 1 1 1 1 1 1 1 1 1 1
symmnumber: 1
zpe: 874183.2 jmol-1
zpe.correction: 0.332959 hartree
zpe.thermalcorrener: 0.352474 hartree
zpe.thermalcorrenthalpy: 0.353419 hartree
zpe.thermalcorrgfe: 0.283170 hartree
zpe.sumelectzpe: -935.245569 hartree
zpe.sumelectthermal: -935.226053 hartree
zpe.sumelectthermalent: -935.225109 hartree
zpe.sumelectthermalfe: -935.295358 hartree
dipole: 5.7378 -3.4986 1.3425
dipole: 6.8531
quadrupole: -109.4019 -118.3182 -135.2354
quadrupole: 8.9318 -2.8643 4.3162
quadrupole: 11.5833 2.6670 -14.2503 8.9318 -2.8643 4.3162
hfenergy: -935.5785274 hartree
pointgroup: C01 [X(C18H19N3O1)]
dipole: -2.2838179 -1.422867 0.1708777 debye
polarizability: 336.7755456|28.8168528|229.0679323|-8.1669539|-63.1157663|141.6482684 unknown
InChI: InChI=1S/C18H19N3O/c1-21(2)11-10-19-18(22)16-9-5-8-15-14-7-4-3-6-13(14)12-20-17(15)16/h3-9,12,19H,10-11H2,1-2H3
charge 0 multiplicity 1
41 atoms
O  2.611558 2.172952 -0.373104
N  5.766301 -0.934622 0.144643
N  2.163969 0.165393 0.723265
N  -0.400208 -0.620438 0.878083
C  -2.135304 0.851587 -0.123484
C  -0.754011 0.554476 0.185097
C  -3.169046 -0.094577 0.299346
C  0.288715 1.465358 -0.216156
C  4.362667 -0.614851 -0.196501
C  3.574268 -0.097589 1.035893
C  -2.758135 -1.279605 1.00457
C  -2.439355 2.053312 -0.827217
C  1.782089 1.290707 0.038467
C  -0.067396 2.636024 -0.909463
C  -4.564531 0.086487 0.054943
C  -1.34938 -1.470035 1.25551
C  -1.419489 2.931697 -1.214079
C  -3.72176 -2.237191 1.441843
C  -5.499767 -0.862921 0.490628
C  6.690122 -0.791005 -0.997431
C  5.919992 -2.23551 0.822469
C  -5.082805 -2.034112 1.188954
H  3.823737 -1.491725 -0.638782
H  4.354675 0.192474 -0.949358
H  4.058285 0.834093 1.377568
H  3.609628 -0.832032 1.860443
H  -3.477138 2.299614 -1.071699
H  1.387902 -0.47684 0.993192
H  0.748245 3.306057 -1.200886
H  -4.920362 0.973151 -0.477589
H  -1.022583 -2.370403 1.792306
H  -1.665925 3.851721 -1.754444
H  -3.378905 -3.130641 1.977278
H  -6.565346 -0.703528 0.292414
H  6.606237 0.227118 -1.415816
H  6.500736 -1.522835 -1.824556
H  7.731012 -0.933638 -0.652902
H  5.29308 -2.273375 1.730415
H  6.970766 -2.37005 1.136891
H  5.638033 -3.105537 0.173606
H  -5.826375 -2.765358 1.522444
