program: Gaussian 09
title: 000154352
version: EM64L-G09RevD.01
frameworkgroup: C1[X(C10H12BrNO)]
method: RPBEPBE
basis: SDD
operation: Freq
keyword: #p
keyword: freq=noraman
keyword: PBEPBE/SDD
title: #p freq=noraman PBEPBE/SDD
converged: YES YES NO NO
title: Mulliken charges:
elementType: Br O N C C C C C C C C C C H H H H H H H H H H H H
charge: -0.057362 -0.268553 -0.343556 -0.524927 0.491507 -0.522198 0.310184 -0.363055 -0.439351 -0.636123 -0.225726 -0.216584 -0.238861 0.266647 0.230608 0.316335 0.308910 0.242117 0.232156 0.239779 0.247401 0.263019 0.228140 0.228390 0.231103
chargesum: 0.00000
title: Mulliken charges with hydrogens summed into heavy atoms:
elementType: Br O N C C C C C C C C C C
charge: -0.057362 -0.268553 -0.027221 -0.027672 0.491507 -0.213288 0.310184 -0.120938 -0.207195 0.114076 0.002414 0.011806 -0.007758
polarizability: 1.55360701e+02 -1.70947515e+01 1.22663961e+02 -2.67480535e-01 8.48858790e+00 1.13913327e+02
1716.lowfreq: -8.7092 -4.4117 -0.0006 -0.0006 -0.0001 0.7605 9.9985 24.3240 40.5583
frequency: 8.2380 24.2840 40.5101 41.8807 126.9884 168.5954 220.2028 244.3018 262.8520 286.6829 296.7043 316.6921 379.3423 403.3664 471.0235 561.5034 593.9619 610.4526 618.1317 676.8205 704.6023 706.0765 756.1604 803.8541 853.7573 855.2241 917.8634 963.5871 977.9772 990.4169 996.4298 1003.4111 1026.4025 1039.6801 1066.1750 1085.3134 1101.8417 1173.2423 1187.6448 1190.0678 1214.7157 1231.1121 1251.1050 1283.8834 1321.4987 1353.5558 1385.9793 1387.2804 1442.1417 1463.2015 1471.3079 1472.0330 1486.2185 1503.7683 1594.7364 1598.0421 1615.3770 2992.4104 2996.1891 3050.5129 3082.2171 3097.8584 3115.8755 3117.0938 3123.6008 3135.9255 3147.4252 3164.8212 3504.5440
redmass: 4.1644 4.8677 6.0810 4.7192 6.2130 3.8187 5.9986 1.3185 2.3913 2.9913 4.3331 4.4775 3.2485 2.7987 3.4432 4.7328 3.4082 3.8447 6.0383 1.2069 3.4640 2.0554 1.8562 3.7856 1.8974 1.6309 1.3995 1.8173 1.3956 6.0634 1.3645 1.7792 2.2052 2.3862 2.0219 1.6839 2.5359 1.0546 1.1127 1.2341 2.5418 1.3069 1.8099 1.3681 1.3138 1.4103 2.1464 1.8298 2.1498 1.0467 1.1813 1.0620 1.9906 1.9334 6.9774 7.3061 6.0472 1.0601 1.0352 1.1018 1.0889 1.0971 1.1006 1.0874 1.0864 1.0912 1.0961 1.1015 1.0780
irintensity: 0.0366 0.4006 3.6292 6.0462 2.9923 1.6905 7.6849 1.2406 4.2026 1.4097 2.7579 8.3464 16.8839 0.4825 14.7506 6.9453 2.2942 80.4570 0.2291 112.9719 9.4160 47.4311 43.8888 5.5465 2.8743 3.1281 2.6098 19.5475 0.0367 0.0765 2.3919 6.2969 10.1034 3.8051 36.7240 22.6968 6.0571 0.0707 1.8687 42.3075 1.7393 17.7689 49.0469 2.1474 8.1372 7.6596 14.3592 8.3762 20.1024 17.6530 33.8004 2.9108 2.2083 252.9646 76.0830 138.9824 4.1031 34.8467 7.9463 9.5517 0.3139 9.9943 20.1549 8.6990 2.3410 11.3169 38.9629 20.7044 49.1868
temp: 298.150 k
press: 1.00000 atm
elementType: 35 8 7 6 6 6 6 6 6 6 6 6 6 1 1 1 1 1 1 1 1 1 1 1 1
symmnumber: 1
zpe: 522509.1 jmol-1
zpe.correction: 0.199013 hartree
zpe.thermalcorrener: 0.212169 hartree
zpe.thermalcorrenthalpy: 0.213113 hartree
zpe.thermalcorrgfe: 0.154616 hartree
zpe.sumelectzpe: -530.754314 hartree
zpe.sumelectthermal: -530.741159 hartree
zpe.sumelectthermalent: -530.740215 hartree
zpe.sumelectthermalfe: -530.798712 hartree
dipole: 1.4116 -1.4251 0.4918
dipole: 2.0653
quadrupole: -80.6294 -96.8442 -79.8567
quadrupole: -6.2320 -2.0331 5.0389
quadrupole: 5.1473 -11.0674 5.9201 -6.2320 -2.0331 5.0389
hfenergy: -530.9533275 hartree
pointgroup: C01 [X(C10H12Br1N1O1)]
dipole: 0.6433567 -0.4891886 -0.0839876 debye
dipolederiv: -0.2695765 -0.0400996 0.0240304 -0.1851895 -0.4860886 -0.299435 -0.0847689 -0.2695872 -0.4456276 -0.7934575 -0.1873278 -0.0644513 0.2452871 -0.8718437 -0.3052423 0.2952457 -0.2319356 -0.4924449 -1.3174118 0.132214 0.1077081 0.0879359 -0.4412836 0.0184363 0.1277181 -0.0035134 -0.4557195 0.5635119 0.0461552 0.037211 0.3516154 0.1894607 -0.0850419 0.1998201 -0.1270121 0.2824269 0.1291577 -0.1196665 0.0575019 -0.2145221 -0.006309 -0.008939 0.0638512 0.0035921 -0.0245918 -0.0138842 -0.1413165 -0.0775707 0.1340278 0.6052487 0.4749381 0.1962865 0.468199 0.6387031 1.4651482 0.2013463 -0.1285332 -0.4504397 0.7138541 0.3180977 -0.7284742 0.2660526 0.3104871 -0.0246953 -0.0063707 -0.0793331 0.0278579 -0.1464384 0.0049466 -0.1312679 -0.0070641 -0.0671118 -0.1564894 -0.0003227 -0.0417435 0.0066393 -0.1104866 -0.0927396 -0.0785838 -0.0917837 0.0366194 -0.0139538 -0.0285964 0.0361996 -0.0417606 -0.0580236 -0.1423616 0.0145662 -0.0278631 -0.1606157 -0.0511882 -0.0226385 -0.0322388 -0.0336619 -0.0875736 -0.1003357 -0.0137014 -0.1009927 0.0864423 0.0675901 -0.0473613 -0.0921144 -0.0214004 -0.1156197 -0.0245138 -0.1028436 -0.0217088 -0.017358 -0.0046862 -0.0970958 0.0364154 -0.0823268 -0.0960151 -0.0632375 0.0397597 -0.0637752 -0.0684103 0.083923 0.0984632 0.0026598 -0.0434206 0.0385278 -0.0200575 -0.0670266 -0.0627435 0.0533185 -0.056696 -0.050433 0.0658561 -0.0660481 0.0737903 0.0429195 0.0210323 0.1104473 -0.1018132 0.3060945 0.0297967 0.0677015 0.0280344 0.2219164 -0.040737 0.1096603 -0.0440692 0.2569001 0.0067145 0.0133862 -0.0356616 0.0458998 -0.0446593 -0.0164774 -0.0223575 -0.051466 -0.0064036 -0.0366879 0.028899 0.096244 0.034921 0.1160566 0.0063916 0.1163024 0.0141623 0.0655924 0.1062806 0.0265039 -0.0084799 0.0092422 0.0927988 0.1067461 0.0148492 0.1018771 -0.0708091 -0.0078656 0.1073949 -0.059745 0.0860914 0.0274366 0.0738521 -0.0308929 0.0327392 0.0649117 -0.0847289 -0.0952188 0.0103756 -0.1152984 0.059752 0.0339644 -0.0031195 0.0058107 0.0899771 0.1408156 0.0014686 0.0109541 0.0215086 0.0029919 -0.0678009 0.0102833 -0.0852719 -0.0102389 0.0827315 0.0139835 0.0246494 0.0213067 0.0981945 0.100799 0.0019664 0.1051976 -0.0748563 -0.0767337 0.0352504 0.0974085 0.0431426 0.1353411 0.0180379 0.1091299 0.0146876 0.0408942 -0.0439127 0.1015856 -0.055044 0.110558 0.0889717 0.0677899 -0.057435 0.0660211 0.0697278 unknown
polarizability: 160.8950129|-8.3574617|108.488075|-5.004932|3.316081|122.5549004 unknown
InChI: InChI=1S/C10H12BrNO/c1-8(11)10(13)12-7-9-5-3-2-4-6-9/h2-6,8,12H,7H2,1H3
charge 0 multiplicity 1
25 atoms
Br -3.338085 -1.52087 -1.785851
O  -2.328471 2.007224 0.306809
N  -1.077594 0.537138 -1.008526
C  0.162549 1.335299 -0.971498
C  1.344978 0.562975 -0.396085
C  -3.476373 0.042704 -0.43735
C  -2.223091 0.935464 -0.373178
C  1.258553 -0.029522 0.890225
C  2.55226 0.445322 -1.126616
C  -3.850255 -0.523234 0.940154
C  2.359481 -0.72533 1.433859
C  3.658028 -0.249449 -0.58323
C  3.563885 -0.837358 0.698276
H  -0.071747 2.223394 -0.355138
H  0.403197 1.688589 -1.992382
H  -1.087755 -0.344539 -1.529587
H  -4.29696 0.645343 -0.858372
H  0.328278 0.061398 1.463839
H  2.629434 0.898408 -2.123153
H  -3.073308 -1.210027 1.31665
H  -4.808641 -1.065038 0.893445
H  -3.948768 0.322176 1.645255
H  2.282848 -1.176507 2.429531
H  4.586713 -0.333396 -1.158667
H  4.418644 -1.377462 1.12039
