program: Gaussian 09
title: 000154351
version: EM64L-G09RevD.01
frameworkgroup: C1[X(C13H29N2O2)]
method: RPBEPBE
basis: SDD
operation: Freq
keyword: #p
keyword: freq=noraman
keyword: PBEPBE/SDD
title: #p freq=noraman PBEPBE/SDD
converged: NO YES NO NO
title: Mulliken charges:
elementType: O O N N C C C C C C C C C C C C C H H H H H H H H H H H H H H H H H H H H H H H H H H H H H
charge: -0.389133 -0.433933 -0.134449 -0.109840 -0.018751 0.243181 0.247990 -0.489476 -0.491786 -0.330782 -0.583842 -0.578661 -0.686946 -0.725203 -0.729922 -0.688245 -0.345770 0.266791 0.239802 0.221711 0.226169 0.242610 0.286915 0.275082 0.268396 0.270814 0.266074 0.275154 0.260100 0.277130 0.199091 0.238734 0.251936 0.199950 0.242555 0.229232 0.242857 0.195750 0.229863 0.239275 0.199933 0.251613 0.223081 0.223893 0.320524 0.380535
chargesum: 1.00000
title: Mulliken charges with hydrogens summed into heavy atoms:
elementType: O O N N C C C C C C C C C C C C C
charge: -0.068609 -0.053398 -0.134449 -0.109840 0.248040 0.243181 0.247990 -0.027963 -0.023007 0.231215 0.221442 0.233723 0.002814 -0.053467 -0.061452 0.002576 0.101204
polarizability: 1.76876321e+02 8.12725103e-01 1.59113323e+02 2.37471583e+00 -1.56276600e-01 1.40157197e+02
1716.lowfreq: -22.0490 -7.0873 -0.0008 -0.0008 -0.0007 11.9022 27.1955 57.7068 74.1765
frequency: 25.6749 57.5506 73.9993 88.7572 116.2584 124.1765 130.7763 186.0605 191.1791 205.3688 208.0175 216.6129 220.5842 244.9169 246.3921 258.0868 272.3302 277.7077 282.1747 292.3779 308.1663 317.9519 343.1042 348.9967 356.3033 371.8453 387.9726 416.8775 426.5778 452.7632 477.8476 488.6469 531.1446 545.6174 550.0570 569.7195 622.6372 757.8170 778.5936 803.4104 831.2875 856.7687 861.9189 880.1455 906.1473 916.0235 922.4770 930.5622 949.4164 953.4090 961.5836 979.7691 984.3267 984.6870 1028.0807 1042.0485 1047.2760 1078.6051 1095.6814 1096.9643 1111.9893 1142.2847 1165.9585 1179.6326 1186.3690 1193.6999 1204.5431 1219.4458 1222.1171 1234.6109 1248.9110 1256.4197 1286.9525 1299.3316 1304.3400 1307.8868 1310.8912 1338.0689 1352.0049 1360.5407 1376.5614 1385.3013 1396.4909 1404.1201 1418.8535 1433.3317 1438.7635 1446.3155 1448.4328 1450.5042 1459.4771 1462.3683 1465.3314 1467.8980 1472.1100 1475.7826 1481.5964 1486.7685 1487.8482 1492.1248 1493.9953 1496.4637 1500.8379 2957.4883 2983.7828 2987.3951 2995.6315 2997.3813 3002.9566 3008.0030 3009.2419 3027.5483 3031.9570 3035.1820 3051.2261 3069.2534 3071.9755 3073.5543 3080.5053 3080.7504 3091.3703 3095.7792 3097.7275 3114.2480 3116.4167 3126.8399 3142.4027 3145.3083 3156.8777 3163.1323 3305.6429 3587.3020
redmass: 4.1494 4.0814 3.5306 2.3336 2.2307 1.1749 2.1410 2.6779 2.4625 1.2868 1.2027 1.5250 1.0782 2.1172 1.8935 1.2660 2.0013 1.4135 1.7131 2.6250 2.9011 3.3665 2.5646 3.7379 2.7480 2.3968 1.1088 2.4339 2.2808 2.8166 2.8469 2.7533 2.8719 2.7724 2.9744 3.3016 3.3909 4.0854 3.0150 1.7440 2.1168 1.7249 1.9714 2.6464 2.7373 1.6071 1.5428 1.9166 5.0500 2.0241 2.8313 1.4181 1.6063 2.5189 2.3541 1.7660 2.1045 1.5699 1.4283 1.4800 2.1019 1.7447 2.1384 2.2550 1.4551 2.6966 2.4033 1.4267 1.8918 2.7903 1.4657 2.0211 1.2159 1.3600 1.2646 1.2696 1.3236 1.4235 1.2442 1.3019 1.1964 1.1902 1.1943 1.1922 1.1846 1.2804 1.0906 1.1754 1.0554 1.0643 1.0523 1.0601 1.0835 1.0526 1.0490 1.0548 1.0584 1.0511 1.0519 1.0561 1.0570 1.0606 1.0758 1.0549 1.0367 1.0372 1.0373 1.0384 1.0576 1.0608 1.1056 1.0816 1.0336 1.0344 1.0613 1.1011 1.0993 1.0993 1.1014 1.1013 1.0975 1.0995 1.0995 1.0996 1.0995 1.1042 1.1041 1.1042 1.1045 1.1048 1.0667 1.0674
irintensity: 3.9522 1.4450 6.7768 13.1175 0.4180 0.1173 0.7725 2.1510 0.8147 2.5053 1.5700 3.7082 0.6645 0.6984 5.7542 0.3122 33.2582 69.3816 52.6003 6.3547 3.3222 6.9501 2.0734 21.8696 0.4838 1.1887 97.3351 10.3331 1.2903 0.8412 4.1435 0.5252 3.6063 4.2387 6.9625 9.3427 5.4656 1.3247 0.6836 32.7400 5.8902 20.6209 36.4570 10.4061 35.7542 4.6774 4.4993 1.4463 5.6850 4.1129 29.4360 7.5699 15.6182 19.7233 0.3946 5.1427 0.4923 1.5543 3.9906 4.7475 6.2752 1.0795 14.4638 12.4358 4.5453 29.7654 4.2530 38.6768 3.7133 26.2992 6.8216 24.6271 20.7617 20.1732 3.0692 2.3700 39.5489 3.2961 20.8543 4.4928 3.3996 47.4342 30.2257 20.8814 20.4392 13.8260 4.3680 10.6274 0.3637 6.5769 3.0944 2.2623 12.3581 3.4642 7.4999 0.8988 8.0705 30.4181 17.5557 35.2260 9.0749 31.8588 41.4844 49.4324 4.1136 29.3537 15.9239 7.7012 17.9971 21.0471 35.1141 8.8312 4.6814 2.9199 7.3428 2.4875 14.7902 21.0473 23.2049 31.6121 49.0638 26.4370 20.4482 11.7048 15.6601 4.7608 1.6765 8.5074 3.3396 4.4766 8.4233 37.5328
temp: 298.150 k
press: 1.00000 atm
elementType: 8 8 7 7 6 6 6 6 6 6 6 6 6 6 6 6 6 1 1 1 1 1 1 1 1 1 1 1 1 1 1 1 1 1 1 1 1 1 1 1 1 1 1 1 1 1
symmnumber: 1
zpe: 1081761.4 jmol-1
zpe.correction: 0.412021 hartree
zpe.thermalcorrener: 0.433067 hartree
zpe.thermalcorrenthalpy: 0.434011 hartree
zpe.thermalcorrgfe: 0.364781 hartree
zpe.sumelectzpe: -770.984505 hartree
zpe.sumelectthermal: -770.963460 hartree
zpe.sumelectthermalent: -770.962515 hartree
zpe.sumelectthermalfe: -771.031745 hartree
dipole: 7.4223 -2.9823 -2.0142
dipole: 8.2487
quadrupole: -87.2622 -85.7470 -91.5801
quadrupole: -6.7843 3.7068 -6.7386
quadrupole: 0.9343 2.4494 -3.3837 -6.7843 3.7068 -6.7386
hfenergy: -771.3965265 hartree
pointgroup: C01 [X(C13H29N2O2)]
dipole: -2.9568846 1.1512881 -0.6807031 debye
polarizability: 176.6849602|1.1296482|159.1227471|-3.4015104|0.5393345|140.3391334 unknown
charge 1 multiplicity 1
46 atoms
O  3.604457 -0.691699 -0.095606
O  -4.283312 -1.777759 -0.65841
N  -1.947816 0.923608 0.541274
N  2.26837 -0.228048 0.30093
C  -0.512245 0.415448 0.096228
C  1.91944 1.054437 -0.415571
C  1.299584 -1.385534 0.346508
C  0.553547 1.523513 0.181816
C  -0.043797 -0.810375 0.901633
C  -2.994324 -0.20655 0.455795
C  -2.38718 2.079499 -0.360514
C  -1.950273 1.4201 1.987438
C  2.992929 2.097018 -0.013761
C  1.8637 0.977483 -1.972745
C  1.073338 -2.145179 -0.998242
C  1.851824 -2.389405 1.3894
C  -3.150617 -0.890002 -0.913124
H  -0.670988 0.137663 -0.961718
H  0.740657 1.789248 1.23821
H  0.259056 2.435318 -0.366007
H  -0.776596 -1.635925 0.882143
H  0.133486 -0.524144 1.954725
H  -2.743699 -0.962959 1.21429
H  -3.965848 0.238668 0.731114
H  -3.462537 2.258112 -0.206257
H  -1.825761 2.986075 -0.097124
H  -2.197939 1.821325 -1.412457
H  -1.232869 2.244764 2.096313
H  -2.963036 1.777188 2.231124
H  -1.679528 0.594102 2.659645
H  2.714648 3.10362 -0.37607
H  3.10643 2.122033 1.083157
H  3.971981 1.829417 -0.441979
H  1.032172 0.369318 -2.367801
H  1.766939 1.995601 -2.390593
H  2.806119 0.566988 -2.379978
H  0.516541 -3.079765 -0.805073
H  0.516547 -1.568059 -1.756815
H  2.037219 -2.449151 -1.446621
H  2.095942 -1.864963 2.328472
H  1.111633 -3.184025 1.595421
H  2.77772 -2.859285 1.021496
H  -3.381123 -0.158676 -1.71525
H  -2.243686 -1.463127 -1.194494
H  3.571441 -0.977401 -1.060402
H  -4.493948 -2.323417 -1.456822
