program: Gaussian 09
title: 000154349
version: EM64L-G09RevD.01
frameworkgroup: C1[X(C10H12BrNO)]
method: RPBEPBE
basis: SDD
operation: Freq
keyword: #p
keyword: freq=noraman
keyword: PBEPBE/SDD
title: #p freq=noraman PBEPBE/SDD
converged: YES YES NO NO
title: Mulliken charges:
elementType: Br O N C C C C C C C C C C H H H H H H H H H H H H
charge: -0.057393 -0.268585 -0.343207 -0.525812 0.491928 -0.522107 0.310116 -0.439124 -0.363015 -0.636130 -0.216625 -0.225878 -0.238789 0.230560 0.266555 0.316251 0.308920 0.232126 0.242353 0.262941 0.247432 0.239860 0.228382 0.228143 0.231096
chargesum: 0.00000
title: Mulliken charges with hydrogens summed into heavy atoms:
elementType: Br O N C C C C C C C C C C
charge: -0.057393 -0.268585 -0.026956 -0.028697 0.491928 -0.213187 0.310116 -0.206998 -0.120662 0.114103 0.011756 0.002265 -0.007692
polarizability: 1.55226059e+02 1.69975395e+01 1.23091240e+02 -1.41124168e-01 8.78347700e+00 1.13639946e+02
1716.lowfreq: -8.9976 -4.3355 -0.0008 -0.0007 -0.0006 2.7306 11.1239 24.5866 40.8350
frequency: 9.2385 24.5640 40.7723 42.1028 126.8563 168.2949 220.4311 244.7491 262.9280 286.9462 296.5703 316.5695 379.2065 403.4705 471.2237 561.4811 594.2617 610.2154 618.1614 676.6440 704.6301 706.2207 756.3225 803.9480 853.4670 855.1647 918.1523 963.6821 978.1151 990.4170 996.4292 1003.3723 1026.4599 1039.4590 1066.2852 1085.3966 1101.7050 1173.2584 1187.7111 1190.0124 1214.6833 1231.0385 1251.1097 1284.0244 1321.8332 1353.5431 1385.8927 1387.1664 1442.0979 1463.2127 1471.0532 1472.1400 1486.2496 1503.8059 1594.7543 1597.9598 1615.4128 2992.8412 2996.1144 3051.1094 3082.2978 3097.7752 3115.9636 3117.1133 3123.6483 3135.9136 3147.4055 3164.8329 3504.6005
redmass: 4.1826 4.8833 5.7946 4.8700 6.2095 3.8316 6.0035 1.3365 2.3295 2.9908 4.3258 4.4818 3.2415 2.7997 3.4507 4.7302 3.4056 3.8394 6.0331 1.2069 3.4834 2.0507 1.8601 3.7806 2.3159 1.4113 1.3997 1.8196 1.3956 6.0604 1.3656 1.7731 2.2076 2.3820 2.0232 1.6859 2.5355 1.0545 1.1130 1.2339 2.5393 1.3110 1.8077 1.3684 1.3115 1.4071 1.9491 2.0068 2.1507 1.0468 1.1784 1.0600 2.0063 1.9328 7.0151 7.2626 6.0464 1.0601 1.0352 1.1018 1.0890 1.0970 1.1006 1.0874 1.0864 1.0912 1.0961 1.1015 1.0780
irintensity: 0.0379 0.4164 2.3193 7.3422 3.0114 1.7059 7.6259 1.2472 4.1545 1.4590 2.7624 8.3076 16.8449 0.4918 14.7260 7.0138 2.1905 80.6915 0.2349 112.6916 9.4393 47.7872 43.7511 5.5325 4.3046 1.7975 2.6755 19.3803 0.0373 0.0789 2.4355 6.2712 10.0197 3.7674 36.9095 22.7681 6.0766 0.0733 1.9533 42.2981 1.7682 17.4034 49.4771 2.1350 8.1153 7.7467 15.2687 7.3590 20.0815 17.6240 32.7258 3.7602 2.2617 252.4620 79.1277 135.6754 4.1287 35.0868 7.7656 9.5143 0.3271 9.9953 20.0860 8.7365 2.3735 11.2371 39.1944 20.9588 49.1632
temp: 298.150 k
press: 1.00000 atm
elementType: 35 8 7 6 6 6 6 6 6 6 6 6 6 1 1 1 1 1 1 1 1 1 1 1 1
symmnumber: 1
zpe: 522531.8 jmol-1
zpe.correction: 0.199022 hartree
zpe.thermalcorrener: 0.212173 hartree
zpe.thermalcorrenthalpy: 0.213117 hartree
zpe.thermalcorrgfe: 0.154751 hartree
zpe.sumelectzpe: -530.754307 hartree
zpe.sumelectthermal: -530.741156 hartree
zpe.sumelectthermalent: -530.740212 hartree
zpe.sumelectthermalfe: -530.798578 hartree
dipole: -1.4102 -1.4239 0.5076
dipole: 2.0673
quadrupole: -80.6959 -96.6559 -79.9812
quadrupole: 6.2759 1.9274 5.2736
quadrupole: 5.0818 -10.8782 5.7965 6.2759 1.9274 5.2736
hfenergy: -530.9533287 hartree
pointgroup: C01 [X(C10H12Br1N1O1)]
dipole: 0.6432772 0.4900921 -0.0868025 debye
dipolederiv: -0.2698849 0.0424386 0.0225458 0.1880886 -0.4868646 0.2978047 -0.0862167 0.269286 -0.444546 -0.7913237 0.1893672 -0.0616499 -0.2431757 -0.8728607 0.305508 0.2973526 0.2288151 -0.4921096 -1.315116 -0.1315835 0.1126823 -0.0868338 -0.4406256 -0.0184295 0.1355966 0.0043036 -0.4585143 0.5654062 -0.0452449 0.0352713 -0.3508823 0.1895755 0.0876861 0.1955882 0.1262441 0.2823509 0.1295646 0.1187799 0.0571616 0.2127066 -0.0076999 0.0070715 0.0650251 -0.0041743 -0.0251008 -0.0125784 0.1373134 -0.0715252 -0.1387019 0.6064042 -0.4740327 0.2023579 -0.469996 0.6372599 1.4573666 -0.2035909 -0.1378115 0.4486523 0.7147251 -0.3194198 -0.7380609 -0.2624378 0.3146079 -0.1571339 0.0019786 -0.0398907 -0.004587 -0.1128691 0.0909366 -0.0771587 0.0894113 0.0401115 -0.0265121 0.0075801 -0.0795284 -0.0258958 -0.1461811 -0.0059783 -0.1316112 0.0061715 -0.0656616 -0.0136938 0.0290624 0.0347204 0.043249 -0.0583642 0.1420791 0.0131527 0.027686 -0.1607808 0.0656955 0.0489145 -0.0921255 0.0232654 -0.1158308 0.0227163 -0.1034753 0.0198862 -0.0153473 -0.0522295 0.0244961 -0.0316449 0.0348248 -0.0908382 0.0989632 -0.0118062 0.0963579 0.0926203 -0.0039132 0.0976084 0.0375358 0.0827741 -0.0968448 0.0621702 0.0398368 0.0631261 -0.0682337 -0.0556957 0.0492492 0.0660526 0.0652508 0.0751482 -0.0419463 0.0210512 -0.1096109 -0.1039127 0.0833275 -0.0980619 0.0017181 0.0435768 0.0377307 0.0195912 -0.0670665 0.0639297 0.054395 0.3070708 -0.0298048 0.0676951 -0.028237 0.2215441 0.0407917 0.1088535 0.0441673 0.2559771 0.0060738 -0.0128839 -0.0360453 -0.0457255 -0.0447258 0.0170209 -0.0225032 0.0517064 -0.0058539 0.1064359 -0.0273771 -0.0101955 -0.0103797 0.0952192 -0.1047341 0.0133133 -0.0993737 -0.0734668 -0.0343847 -0.0306176 0.0967531 -0.0367829 0.1161839 -0.0051926 0.1163484 -0.0132447 0.0636016 0.1409815 -0.0008544 0.0096047 -0.0210593 0.0027399 0.0679223 0.008902 0.085393 -0.0105357 -0.0842116 0.095264 0.0121336 0.1151532 0.0595673 -0.0352097 -0.0012486 -0.0067461 0.0897822 -0.0090002 -0.1076323 -0.0591134 -0.0867496 0.0279225 -0.0728504 -0.0303183 -0.0316652 0.0655292 -0.0747852 -0.0369421 0.097583 -0.0451682 0.135487 -0.0161981 0.1097569 -0.0130251 0.0388996 0.0831243 -0.0154902 0.023498 -0.0225457 0.1014082 -0.0994475 0.0000658 -0.1012116 -0.0799107 -0.044584 -0.1019688 -0.055425 -0.1108172 0.090049 -0.0668226 -0.0577356 -0.064999 0.0688388 unknown
polarizability: 160.6825696|8.3820033|108.2059018|-5.1008315|-3.6681223|123.0687738 unknown
charge 0 multiplicity 1
25 atoms
Br -3.352089 1.533402 -1.760145
O  -2.325763 -1.999234 0.316477
N  -1.085706 -0.526917 -1.006641
C  0.154143 -1.326163 -0.98315
C  1.340499 -0.558904 -0.409046
C  -3.478562 -0.031739 -0.412184
C  -2.225694 -0.925911 -0.361879
C  2.540698 -0.429198 -1.149109
C  1.264504 0.01731 0.885332
C  -3.837732 0.53298 0.969714
C  3.649747 0.26161 -0.607318
C  2.368747 0.708962 1.427486
C  3.56602 0.833223 0.682241
H  0.388106 -1.671578 -2.008248
H  -0.077065 -2.21864 -0.372052
H  -1.099795 0.356236 -1.525096
H  -4.304091 -0.632857 -0.825637
H  2.609801 -0.86973 -2.151843
H  0.339759 -0.083175 1.466266
H  -3.930862 -0.313179 1.674671
H  -4.795534 1.076584 0.933221
H  -3.05581 1.217803 1.339443
H  4.5729 0.355062 -1.190145
H  2.3003 1.147363 2.429437
H  4.423382 1.370091 1.103206
