program: Gaussian 09
title: 000013746
version: EM64L-G09RevD.01
frameworkgroup: C1[X(C10H12N3O4PS)]
method: RPBEPBE
basis: SDD
operation: Freq
keyword: #p
keyword: freq=noraman
keyword: PBEPBE/SDD
title: #p freq=noraman PBEPBE/SDD
converged: YES YES NO NO
title: Mulliken charges:
elementType: S P O O O O N N N C C C C C C C C C C H H H H H H H H H H H H
charge: 0.038549 1.075033 -0.515923 -0.478266 -0.256140 -0.584929 -0.197222 -0.003291 -0.084194 0.161339 -0.615913 0.249318 0.051563 -0.313342 -0.293639 -0.219735 -0.197999 -0.481244 -0.506182 0.317681 0.318675 0.277109 0.269144 0.243663 0.244457 0.242982 0.247913 0.237791 0.237792 0.241092 0.293918
chargesum: 0.00000
title: Mulliken charges with hydrogens summed into heavy atoms:
elementType: S P O O O O N N N C C C C C C C C C C
charge: 0.038549 1.075033 -0.515923 -0.478266 -0.256140 -0.584929 -0.197222 -0.003291 -0.084194 0.161339 0.020442 0.249318 0.051563 -0.036233 -0.024496 0.023929 0.046459 0.247443 0.266619
polarizability: 3.13163031e+02 4.25456329e+00 1.79948449e+02 1.75753604e+01 -9.30823160e-02 1.15087085e+02
1716.lowfreq: -16.9908 -4.5994 -2.8832 -0.0016 -0.0013 0.0008 16.5478 27.3257 34.6407
frequency: 12.4543 27.2901 34.6393 45.2032 55.0786 74.2360 90.1028 108.0007 122.9999 132.2875 136.9190 146.8158 159.7158 190.4443 219.7474 228.1513 265.3855 281.8218 306.3807 332.7484 343.2489 364.3082 422.1308 452.5636 462.4154 476.8968 482.4440 520.0999 551.9737 596.6926 606.1057 641.6078 669.1091 678.0468 693.4667 765.1424 781.3086 792.6073 804.6690 849.5514 903.3117 945.6390 951.3428 960.1545 984.9474 987.3442 1010.8598 1024.8965 1044.9047 1096.4052 1109.6653 1122.1354 1126.6080 1130.8691 1164.7450 1186.4128 1192.9197 1248.7125 1273.6868 1282.8525 1305.6027 1384.1543 1412.1257 1419.7065 1424.0330 1431.2601 1444.4018 1455.4478 1459.8510 1463.1677 1468.3620 1472.8556 1566.2126 1612.6766 1613.9261 2994.0974 2997.9493 3064.9955 3097.6123 3114.5227 3132.8794 3135.4458 3144.5290 3158.2888 3165.0662 3171.6270 3181.6057
redmass: 5.9219 6.4470 2.9198 4.4772 7.6887 1.9755 1.8377 5.4104 1.4760 3.1036 3.4757 4.0333 6.4072 7.9034 6.4591 5.8437 4.2507 10.3174 4.3317 6.3189 7.3712 7.2338 3.4955 5.6652 10.0576 6.1286 8.6582 6.5440 9.7279 10.2710 5.2044 6.1358 10.1874 6.5171 4.9943 7.1300 3.4012 1.5690 2.9307 5.6235 1.4495 11.2503 5.7522 11.3658 1.3772 2.3713 1.3492 2.1058 17.0444 2.2436 1.2327 1.2556 1.2626 1.2909 1.3373 2.0504 2.3802 2.4416 1.8901 1.6250 1.2398 5.5164 4.0772 1.2842 1.1380 1.1184 2.5196 1.0520 1.0599 2.7798 1.0528 1.0657 6.9075 6.7244 10.6902 1.0292 1.0281 1.0574 1.1058 1.1062 1.1049 1.1041 1.0868 1.0906 1.1103 1.0959 1.0999
irintensity: 0.5534 1.1199 3.7470 0.2581 1.5960 1.7575 0.9464 4.3403 1.6163 8.9737 0.9082 9.1786 5.1086 0.6501 7.1617 12.9597 5.0875 8.4112 5.6934 16.2013 7.6068 20.7964 1.1869 0.4094 149.2403 7.7803 21.3794 8.0427 15.3855 170.5184 7.5172 2.0618 85.3038 6.8477 50.6627 44.8675 27.2611 49.2828 132.3796 20.7629 0.2165 78.5874 23.2957 279.5637 2.5462 65.9189 0.0216 10.2211 111.0839 5.0993 0.6572 0.3666 0.8395 0.0615 0.9536 20.8050 0.7404 65.5015 44.1829 10.0803 14.0379 54.3343 4.5777 35.6804 9.1959 1.2966 22.9827 13.3767 2.1902 2.7438 20.1337 13.7147 13.3286 0.6110 241.4465 57.6094 40.2823 2.8324 25.4159 4.5519 6.6984 10.6200 3.0745 5.6031 2.0205 5.5533 15.9575
temp: 298.150 k
press: 1.00000 atm
elementType: 16 15 8 8 8 8 7 7 7 6 6 6 6 6 6 6 6 6 6 1 1 1 1 1 1 1 1 1 1 1 1
symmnumber: 1
zpe: 574001.9 jmol-1
zpe.correction: 0.218626 hartree
zpe.thermalcorrener: 0.238961 hartree
zpe.thermalcorrenthalpy: 0.239905 hartree
zpe.thermalcorrgfe: 0.166095 hartree
zpe.sumelectzpe: -1591.232247 hartree
zpe.sumelectthermal: -1591.211912 hartree
zpe.sumelectthermalent: -1591.210968 hartree
zpe.sumelectthermalfe: -1591.284778 hartree
dipole: 4.2756 3.4351 2.3553
dipole: 5.9690
quadrupole: -92.0566 -127.9624 -130.8114
quadrupole: 2.6453 -9.6604 1.1200
quadrupole: 24.8868 -11.0189 -13.8679 2.6453 -9.6604 1.1200
hfenergy: -1591.4508732 hartree
pointgroup: C01 [X(C10H12N3O4P1S1)]
dipole: 1.670066 1.2683266 1.0569236 debye
polarizability: 312.6216741|2.442466|179.5276083|20.7019008|5.1280612|116.0492827 unknown
InChI: InChI=1S/C8H6N3OS.C2H6O3P/c12-8-6-3-1-2-4-7(6)9-10-11(8)5-13;1-4-6(3)5-2/h1-4H,5H2;1-2H3
charge 0 multiplicity 1
31 atoms
S  -2.078738 -0.989848 0.578669
P  -3.982342 -0.093823 -0.365081
O  -4.816131 0.192634 1.131138
O  -3.560439 1.471532 -0.953903
O  0.230761 1.523686 -0.54036
O  -4.757929 -0.933305 -1.465688
N  0.404257 -0.814356 -0.657084
N  1.11432 -2.067247 -0.539248
N  2.371026 -2.040327 -0.199548
C  2.368469 0.45387 -0.053886
C  -0.993992 -0.987012 -1.016671
C  0.942754 0.485036 -0.42338
C  3.032731 -0.807059 0.051666
C  3.083584 1.649731 0.202325
C  4.403988 -0.865585 0.414834
C  4.442409 1.58488 0.56014
C  5.101747 0.327389 0.667348
C  -6.247263 -0.193934 1.221307
C  -2.912463 2.459402 -0.046751
H  -1.325616 -0.146531 -1.644239
H  -1.110153 -1.959194 -1.510224
H  2.555815 2.604424 0.114886
H  4.881657 -1.847003 0.487614
H  4.998452 2.507013 0.758433
H  6.159339 0.291461 0.948131
H  -6.501557 -0.038787 2.280123
H  -6.389747 -1.251477 0.939821
H  -6.870553 0.45023 0.576833
H  -3.473815 2.540129 0.899847
H  -2.96152 3.404233 -0.608618
H  -1.862652 2.173637 0.127563
