program: Gaussian 09
title: 000154337
version: EM64L-G09RevD.01
frameworkgroup: C1[X(C14H12O3)]
method: RPBEPBE
basis: SDD
operation: Freq
keyword: #pfreq=noraman
keyword: PBEPBE/SDD
title: #p freq=noraman PBEPBE/SDD
converged: YES YES NO NO
title: Mulliken charges:
elementType: O O O C C C C C C C C C C C C C C H H H H H H H H H H H H
charge: -0.239576 -0.188011 -0.177983 0.082506 0.256591 -0.020243 -0.761432 -0.290333 0.168093 0.196953 -0.428104 0.453921 -0.761256 -0.361316 -0.412376 -0.241809 -0.222610 0.234799 0.261358 0.230049 0.228854 0.239055 0.240329 0.232648 0.268799 0.287544 0.245722 0.241371 0.236458
chargesum: 0.00000
title: Mulliken charges with hydrogens summed into heavy atoms:
elementType: O O O C C C C C C C C C C C C C C
charge: -0.239576 -0.188011 -0.177983 0.082506 0.256591 -0.020243 -0.035226 -0.061479 0.168093 0.196953 -0.189049 0.453921 -0.019480 -0.073772 -0.166654 -0.000438 0.013848
polarizability: 2.54457963e+02 -6.95108170e+00 1.57663125e+02 9.82780094e+00 7.06452805e+00 9.05963440e+01
1716.lowfreq: -13.7969 -0.0004 -0.0003 0.0003 4.9342 5.7333 11.5855 34.5570 73.9208
frequency: 5.5172 34.4068 73.9177 94.7666 114.7714 143.8794 150.0100 189.0759 212.1839 240.0024 270.2953 292.0842 295.4438 312.4926 369.6175 409.9851 446.4782 456.7712 473.0691 512.5849 532.8746 563.7144 569.9339 598.8904 619.6337 654.5541 694.8594 706.4974 755.2527 765.3593 802.1624 808.7478 837.5703 861.0010 903.4098 908.5750 952.3476 973.7908 986.0828 996.0308 1006.9156 1028.0677 1048.4595 1072.8992 1090.4977 1105.1298 1144.2247 1175.0377 1204.8793 1217.8327 1237.5498 1261.2385 1298.4648 1315.6732 1371.8648 1385.6359 1390.5741 1406.7444 1442.0895 1444.4669 1452.0117 1459.2218 1477.1535 1482.5008 1551.8419 1569.3229 1612.3474 1630.2958 1636.3790 2984.4691 2996.0414 3079.4451 3087.4766 3111.6320 3125.8889 3128.9244 3130.6948 3144.0755 3155.9370 3165.6493 3171.1326
redmass: 1.2041 3.9490 3.9781 6.3027 3.0416 2.3567 1.7647 3.2857 3.6370 4.2460 3.3081 6.9669 4.3541 6.1845 6.3555 3.1483 3.7092 4.3191 6.8818 4.3900 4.3396 3.7850 5.3496 4.0694 4.0361 5.6323 3.3311 6.1935 2.5525 1.6698 3.2196 1.9145 3.8321 4.3456 1.7193 2.4857 2.0264 1.3257 1.3998 2.0072 1.3607 2.3961 2.4513 1.8171 2.1138 2.3124 1.5867 1.0825 3.1014 2.3882 1.9599 1.8490 3.2327 3.5582 1.2143 1.6319 2.9309 1.8512 1.0743 2.2978 1.0806 1.0755 1.2773 1.9446 10.3240 7.0789 6.7492 9.9334 7.3500 1.0404 1.0362 1.0917 1.0993 1.0985 1.1012 1.0877 1.0874 1.0898 1.0941 1.0963 1.1003
irintensity: 1.4372 0.8160 0.9838 1.5946 0.2943 3.6673 3.0967 1.4376 3.1546 1.7075 1.1275 14.3023 1.2709 5.2074 3.3029 6.7167 1.0205 6.2811 3.8477 2.5389 4.2305 20.0853 1.5403 20.4610 6.2297 3.7819 17.4479 2.6065 26.0069 12.7681 11.1982 48.1088 34.6327 10.0813 9.2127 29.3848 26.1649 0.3178 5.5858 3.5165 0.0818 11.4440 10.4583 22.8378 51.8569 11.7332 1.7303 2.9986 79.6345 6.8739 8.3801 2.8473 14.5170 97.5737 54.3490 2.7501 42.1995 9.6133 16.0088 9.1133 19.4189 3.8848 33.3190 4.4158 140.6216 10.4841 22.7752 118.3006 38.1801 4.1361 15.4167 14.7814 9.7342 15.5313 9.3333 0.2033 7.2368 10.4686 9.7447 15.0586 25.0814
temp: 298.150 k
press: 1.00000 atm
elementType: 8 8 8 6 6 6 6 6 6 6 6 6 6 6 6 6 6 1 1 1 1 1 1 1 1 1 1 1 1
symmnumber: 1
zpe: 576536.2 jmol-1
zpe.correction: 0.219591 hartree
zpe.thermalcorrener: 0.235062 hartree
zpe.thermalcorrenthalpy: 0.236006 hartree
zpe.thermalcorrgfe: 0.174774 hartree
zpe.sumelectzpe: -765.106240 hartree
zpe.sumelectthermal: -765.090769 hartree
zpe.sumelectthermalent: -765.089825 hartree
zpe.sumelectthermalfe: -765.151057 hartree
dipole: 4.4774 3.4231 4.6612
dipole: 7.3138
quadrupole: -89.7667 -92.3020 -104.4906
quadrupole: -8.9135 -10.7319 -0.9155
quadrupole: 5.7531 3.2178 -8.9708 -8.9135 -10.7319 -0.9155
hfenergy: -765.3258315 hartree
pointgroup: C01 [X(C14H12O3)]
dipole: -1.7851234 -1.4912756 1.6939145 debye
polarizability: 254.8862002|-5.4788396|158.255447|-7.0131844|-2.2189555|89.5757857 unknown
InChI: InChI=1S/C14H12O3/c1-9(15)13(2)14(17-13)8-7-10-5-3-4-6-11(10)12(14)16/h3-8H,1-2H3
charge 0 multiplicity 1
29 atoms
O  1.883344 -0.680235 -1.400435
O  0.54619 1.693655 -0.3002
O  3.745783 1.397364 -0.38036
C  0.833339 -0.707526 -0.258288
C  2.337271 -0.542573 0.005309
C  -0.013737 0.557169 -0.209675
C  3.182914 -1.6891 0.551802
C  0.151239 -2.008045 -0.083223
C  2.929157 0.834563 0.387084
C  -1.480775 0.403502 -0.050349
C  -1.202095 -2.086526 0.093284
C  -2.058557 -0.897468 0.110413
C  2.666259 1.319805 1.80724
C  -2.308394 1.555091 -0.058527
C  -3.465319 -1.006569 0.266495
C  -3.702455 1.430117 0.096247
C  -4.279772 0.144556 0.260298
H  2.860467 -2.659019 0.141705
H  4.235451 -1.532246 0.25678
H  3.131591 -1.734234 1.654464
H  0.760275 -2.915489 -0.129068
H  -1.682643 -3.064468 0.214459
H  1.672722 1.022091 2.179954
H  3.432724 0.893933 2.4852
H  2.758598 2.416666 1.838668
H  -1.833368 2.533141 -0.186829
H  -3.916839 -1.997779 0.389551
H  -4.339415 2.320434 0.090482
H  -5.364053 0.045387 0.381119
