program: Gaussian 09
title: 000154334
version: EM64L-G09RevD.01
frameworkgroup: C1[X(C13H11NO3)]
method: RPBEPBE
basis: SDD
operation: Freq
keyword: #p
keyword: freq=noraman
keyword: PBEPBE/SDD
title: #p freq=noraman PBEPBE/SDD
converged: YES YES NO NO
title: Mulliken charges:
elementType: O O O N C C C C C C C C C C C C C H H H H H H H H H H H
charge: -0.207675 -0.163583 -0.144804 0.023512 0.061372 0.176165 0.265752 0.206748 -0.726418 -0.709048 -0.413490 -0.168373 0.484355 -0.450491 -0.328624 -0.367932 -0.176518 0.235179 0.232926 0.239611 0.230537 0.233657 0.260104 0.242089 0.236824 0.249473 0.246749 0.231903
chargesum: 0.00000
title: Mulliken charges with hydrogens summed into heavy atoms:
elementType: O O O N C C C C C C C C C C C C C
charge: -0.207675 -0.163583 -0.144804 0.023512 0.061372 0.176165 0.265752 0.206748 -0.018702 0.015250 -0.171401 -0.168373 0.484355 -0.213667 -0.079151 -0.121183 0.055385
polarizability: 2.29691045e+02 -1.10228096e+01 1.63688437e+02 1.43935520e+00 4.56209397e-01 8.46859380e+01
1716.lowfreq: -6.5831 -5.7812 -5.5943 -0.0009 -0.0006 -0.0004 46.4073 68.0248 119.0315
frequency: 46.3980 68.0238 119.0301 166.5720 173.5498 187.4513 196.1836 223.0055 230.5237 269.4465 285.0172 338.8696 373.8629 416.7298 432.7631 441.9603 498.3586 520.9234 543.6123 561.9616 571.1748 612.1936 624.7807 645.0201 696.7758 736.0754 755.9298 781.3718 786.1482 798.8066 807.2316 832.9068 846.8858 853.5647 870.1049 940.5553 940.8054 956.3906 990.6930 1030.7765 1035.4178 1071.1620 1096.9457 1101.0667 1109.7862 1144.4152 1164.1094 1212.1139 1217.1568 1253.5456 1288.5407 1294.6859 1344.5600 1366.1885 1389.0470 1396.1234 1403.2951 1427.5707 1437.1489 1450.1354 1457.8394 1463.8723 1473.8580 1510.3871 1553.7828 1593.8668 1623.3109 2992.5454 3005.4450 3083.8926 3103.7947 3104.9114 3116.4523 3125.6879 3130.8894 3133.9038 3155.5501 3167.1101
redmass: 4.8901 5.5374 4.8392 4.1401 2.5408 1.4206 1.5547 3.3900 1.6027 3.9192 3.7975 4.1663 4.8262 4.4046 4.9813 5.1553 5.9108 4.0376 5.4715 4.6832 3.9732 5.7487 6.8598 6.4264 4.7844 7.3839 3.6232 1.6135 2.2969 11.7494 4.0178 3.7462 1.8741 2.4772 4.6104 3.6007 1.4052 1.3664 1.3868 2.4882 4.1724 2.0417 1.9767 2.1378 2.3476 1.3145 1.7542 2.5430 2.1712 2.4176 4.5789 3.8733 5.6548 2.4307 1.2682 1.2901 2.4097 2.5653 3.5870 1.0509 1.0672 1.0866 1.0517 4.5582 7.6512 6.1853 8.4758 1.0363 1.0360 1.0986 1.0991 1.1002 1.1007 1.0885 1.0877 1.0908 1.0975 1.0992
irintensity: 1.3610 3.5658 1.2680 2.1794 2.3724 0.4799 1.2514 3.7988 0.1752 0.9816 0.0932 0.2259 1.7036 1.6033 3.3529 11.4402 0.3789 4.8871 1.5990 0.6890 5.6339 3.4185 1.1615 9.5676 17.1121 18.0064 18.1153 1.1958 2.4320 0.2053 26.1108 72.1089 71.8595 3.0439 66.1078 2.0859 0.4461 0.2829 1.0682 3.7152 111.6851 5.8778 27.7699 95.2005 27.1578 0.9585 16.8866 3.7773 1.9226 7.8802 40.2027 33.7678 10.3857 79.0615 20.6242 37.2410 21.9522 18.6796 24.0066 21.4618 4.3356 4.5197 17.3672 19.2920 22.6083 13.4374 1.1472 8.5960 5.5775 11.5334 8.0521 14.6174 15.3066 12.5275 1.8942 13.7632 18.0115 30.7941
temp: 298.150 k
press: 1.00000 atm
elementType: 8 8 8 7 6 6 6 6 6 6 6 6 6 6 6 6 6 1 1 1 1 1 1 1 1 1 1 1
symmnumber: 1
zpe: 551314.3 jmol-1
zpe.correction: 0.209985 hartree
zpe.thermalcorrener: 0.223865 hartree
zpe.thermalcorrenthalpy: 0.224809 hartree
zpe.thermalcorrgfe: 0.169807 hartree
zpe.sumelectzpe: -781.106730 hartree
zpe.sumelectthermal: -781.092849 hartree
zpe.sumelectthermalent: -781.091905 hartree
zpe.sumelectthermalfe: -781.146907 hartree
dipole: 1.5149 3.1486 -3.6052
dipole: 5.0206
quadrupole: -78.7161 -93.2936 -104.6618
quadrupole: 2.5490 11.3117 0.3238
quadrupole: 13.5077 -1.0698 -12.4380 2.5490 11.3117 0.3238
hfenergy: -781.3167142 hartree
pointgroup: C01 [X(C13H11N1O3)]
dipole: 0.6211992 -1.2717562 1.3778192 debye
polarizability: 229.7251061|10.4718462|163.4374688|-5.096569|1.7262934|84.9028452 unknown
InChI: InChI=1S/C13H11NO3/c1-12-9-6-5-8-4-3-7-14-10(8)11(9)15-13(12,2)17-16-12/h3-7H,1-2H3
charge 0 multiplicity 1
28 atoms
O  -0.855799 1.450592 0.243374
O  -2.825289 -0.614596 -1.240107
O  -2.741191 0.962063 -1.253694
N  2.048303 1.614134 0.076209
C  -2.200563 -0.612529 0.168734
C  -2.25086 0.958323 0.16479
C  -0.71828 -0.895744 0.118134
C  -0.023247 0.321605 0.123771
C  -3.053961 -1.442512 1.110569
C  -3.116289 1.81006 1.060521
C  -0.021128 -2.131565 0.052351
C  1.401532 0.388894 0.060865
C  2.101203 -0.885051 -0.015436
C  1.375807 -2.123029 -0.017964
C  3.532658 -0.830116 -0.085836
C  3.393102 1.602272 0.008593
C  4.179312 0.406461 -0.075197
H  -3.042971 -2.502561 0.798196
H  -2.666424 -1.389044 2.143542
H  -4.100428 -1.096063 1.096341
H  -4.164176 1.472082 1.014063
H  -2.758895 1.772766 2.103394
H  -3.07076 2.85832 0.717907
H  -0.5735 -3.077163 0.042727
H  1.933957 -3.064027 -0.080003
H  4.102869 -1.764175 -0.147449
H  3.883836 2.582789 0.020759
H  5.269985 0.479115 -0.128755
