program: Gaussian 09
title: 000154318
version: EM64L-G09RevD.01
frameworkgroup: C1[X(C10H10O5)]
method: RPBEPBE
basis: SDD
operation: Freq
keyword: #pfreq=noraman
keyword: PBEPBE/SDD
title: #p freq=noraman PBEPBE/SDD
converged: YES YES NO NO
title: Mulliken charges:
elementType: O O O O O C C C C C C C C C C H H H H H H H H H H
charge: -0.160298 -0.285667 -0.130573 -0.457532 -0.422143 0.053502 0.156901 0.333661 -0.410694 -0.339650 0.243439 -0.368384 -0.347968 -0.245764 -0.196550 0.226495 0.213273 0.224155 0.229956 0.236116 0.256255 0.231648 0.364689 0.233991 0.361142
chargesum: 0.00000
title: Mulliken charges with hydrogens summed into heavy atoms:
elementType: O O O O O C C C C C C C C C C
charge: -0.160298 -0.285667 -0.130573 -0.092843 -0.061001 0.053502 0.156901 0.333661 0.029075 0.114461 0.243439 -0.132268 -0.091713 -0.014116 0.037441
polarizability: 1.53597122e+02 2.06517274e+00 1.25534581e+02 6.89121968e+00 6.83547624e+00 7.95800923e+01
1716.lowfreq: -8.9229 -5.4583 -0.0005 0.0004 0.0006 7.9706 45.2856 58.7117 70.8245
frequency: 45.1576 58.6843 70.7839 94.0599 127.4994 170.7444 194.3429 202.0133 230.8096 286.1705 314.4237 326.3931 365.4014 418.7181 430.9807 447.3574 509.5983 540.5611 545.3186 588.5491 621.6332 666.3675 699.5379 735.0199 758.4221 782.9689 796.8123 818.8628 837.0245 863.3546 911.0646 941.6424 973.1183 977.9424 980.5470 991.8975 1014.0599 1042.8875 1052.6814 1085.7191 1126.3504 1164.4193 1167.8668 1186.8660 1196.6246 1218.0463 1248.2283 1288.6646 1311.2086 1324.3907 1385.9752 1398.1222 1401.2500 1448.6518 1458.3277 1464.7432 1476.6586 1605.3506 1623.1665 2960.1567 2990.2574 3019.8373 3098.9682 3135.2182 3144.8751 3165.6527 3180.0404 3545.6605 3588.3954
redmass: 6.3299 5.0340 4.4471 4.8086 4.9834 1.2188 4.1350 5.2389 2.7333 3.2758 4.7752 5.0470 6.8726 1.2461 5.2465 3.5140 4.4779 4.4548 5.3967 5.4707 7.2570 5.7468 6.1838 4.6881 1.3410 3.8208 10.5131 3.9027 4.6327 1.4720 5.0415 1.4462 4.0743 4.8973 1.4044 3.9790 2.2773 2.2180 3.4144 2.1191 1.4639 1.2517 1.5249 1.7986 1.2506 2.0487 1.7864 1.7760 2.2563 1.4048 1.3074 6.3015 1.5457 2.5499 1.0878 2.9313 1.0848 7.2736 7.8726 1.0575 1.0666 1.1049 1.0970 1.0866 1.0910 1.0962 1.0982 1.0656 1.0671
irintensity: 1.1321 2.0137 7.7933 6.7018 1.8406 113.4494 22.0456 1.7369 1.8666 2.8001 4.6216 2.2590 3.0592 152.3045 1.7208 12.2797 41.2620 0.7845 4.2184 12.7645 4.6373 10.5775 18.3917 0.6112 83.9258 32.6062 9.2166 40.2475 30.9708 5.6940 83.4863 1.5511 148.3319 55.8313 2.8266 28.7081 16.1724 12.5162 17.3734 16.6925 13.3893 4.6627 47.2159 11.8311 6.8922 56.5201 17.2909 5.6651 16.9281 44.5395 23.2628 10.3717 2.2409 53.3376 7.3016 11.3106 11.9681 12.8226 53.7284 38.7315 28.7260 32.3588 11.9530 0.4789 12.3870 20.7188 7.6738 13.7873 9.1777
temp: 298.150 k
press: 1.00000 atm
elementType: 8 8 8 8 8 6 6 6 6 6 6 6 6 6 6 1 1 1 1 1 1 1 1 1 1
symmnumber: 1
zpe: 483549.1 jmol-1
zpe.correction: 0.184174 hartree
zpe.thermalcorrener: 0.197856 hartree
zpe.thermalcorrenthalpy: 0.198800 hartree
zpe.thermalcorrgfe: 0.143456 hartree
zpe.sumelectzpe: -761.939295 hartree
zpe.sumelectthermal: -761.925613 hartree
zpe.sumelectthermalent: -761.924669 hartree
zpe.sumelectthermalfe: -761.980013 hartree
dipole: -3.2525 3.6939 -3.0287
dipole: 5.7790
quadrupole: -86.3014 -69.9241 -95.6377
quadrupole: 9.1630 -3.2507 -1.3651
quadrupole: -2.3470 14.0303 -11.6833 9.1630 -3.2507 -1.3651
hfenergy: -762.1234687 hartree
pointgroup: C01 [X(C10H10O5)]
dipole: -1.2650288 1.4264152 -1.238706 debye
dipolederiv: -0.3821442 -0.0209483 -0.0278252 -0.116196 -0.2509873 0.0066125 -0.279476 0.1029458 -0.302751 -1.5530839 0.054425 -0.0720219 -0.0482301 -0.4670857 -0.0857503 0.1037702 -0.0311311 -0.3192352 -0.2776824 -0.1153566 -0.015913 -0.0436172 -0.1251158 0.0229779 -0.0024562 -0.204202 -0.4304 -0.5353746 0.0552151 -0.0041186 0.0667089 -0.1909498 0.034608 0.044475 0.1234014 -0.7585638 -0.3393139 0.1872563 0.1014258 0.2808711 -0.6671669 -0.0026283 0.1982594 -0.0367338 -0.5538939 0.6048621 0.2687631 0.06703 0.1522566 0.231892 -0.0266188 0.2935055 -0.1822286 0.2969228 0.8824006 0.2103058 0.0551568 0.5294728 0.3322963 0.1319514 -0.0667331 0.2764649 0.6081968 -0.4044968 -0.1628908 -0.0368905 0.204578 -0.230431 -0.0121009 0.0954299 0.0462614 -0.1009049 0.3020064 -0.0357743 0.0110337 -0.0735362 0.2017148 -0.0180477 -0.0695553 -0.1051081 0.6090775 0.21558 -0.1264758 0.0380422 -0.1333528 0.5207912 -0.0671088 -0.0477866 -0.0241977 0.2462876 1.1301241 -0.2190454 0.011048 -0.3726762 0.1768386 -0.0073558 -0.0598256 -0.0369806 0.0814602 0.2194323 0.1238027 0.0351466 -0.0987823 0.1266963 0.005337 0.025265 0.0294551 -0.0846589 -0.3659689 0.1246392 0.0168558 -0.0387835 0.0662999 0.0329796 -0.0289119 0.0261466 -0.1635347 -0.0736292 -0.1294951 -0.0054102 -0.1745198 -0.1931332 -0.0193535 -0.0060789 -0.0071144 -0.1833069 0.113861 -0.0502624 0.0042465 0.0628367 0.1590527 0.0379074 0.0149946 0.0264563 -0.125196 -0.144149 -0.0755791 -0.0696832 -0.0355076 0.0697542 -0.0034 -0.0214519 0.0192207 -0.0285389 0.0111031 0.1356438 0.0567707 0.0740431 -0.0552059 -0.0664951 0.0430418 -0.0270154 -0.0489104 -0.0170082 -0.077978 -0.0049227 -0.0526689 -0.0276938 -0.0231364 -0.0304696 -0.0465948 0.0814486 0.03341 0.0687005 -0.0663911 0.0458896 0.0142748 0.0208336 -0.0463026 0.0704377 -0.0871117 0.1006209 -0.0261285 -0.0109246 0.0121421 -0.0883475 -0.016461 -0.010471 -0.0231141 0.1375325 0.0970912 0.0212189 -0.0006883 -0.0015632 -0.0467482 -0.0228027 -0.0013118 -0.0260441 0.1733713 -0.0809275 0.0755735 -0.0069106 0.0852584 0.0430114 -0.0063159 -0.0090104 -0.0079307 0.1668363 0.3555032 -0.0554057 0.0083229 -0.0658097 0.0510462 0.0786827 -0.009277 0.0268269 0.2680453 -0.0687038 -0.089067 -0.0205224 -0.0876255 0.0440211 -0.0151246 -0.0180924 -0.0154642 0.1540598 0.1764875 -0.1411368 -0.0628569 -0.1711885 0.3051757 0.0208099 -0.1115311 0.0262425 0.3637676 unknown
polarizability: 154.0276703|1.6385479|126.0183244|5.0137412|3.9911688|78.6658011 unknown
InChI: InChI=1S/C10H10O5/c11-5-9-7-3-1-2-4-8(7)13-10(9,6-12)15-14-9/h1-4,11-12H,5-6H2
charge 0 multiplicity 1
25 atoms
O  0.92255 0.996984 1.780837
O  0.428352 -1.489695 -0.073993
O  1.813726 -0.293664 1.57752
O  0.829547 2.038739 -1.822805
O  3.089384 -1.920049 -0.730677
C  0.537394 0.93134 0.28647
C  1.384113 -0.373989 0.150994
C  -0.878083 0.470839 0.096043
C  1.001346 2.220975 -0.376193
C  2.539843 -0.569633 -0.823497
C  -0.877219 -0.936959 -0.046329
C  -2.094632 1.17466 0.083903
C  -2.051727 -1.686701 -0.188365
C  -3.299735 0.444041 -0.058193
C  -3.273012 -0.967298 -0.188846
H  2.061566 2.40452 -0.110813
H  0.391094 3.063921 0.012413
H  3.369028 0.108171 -0.566707
H  2.175299 -0.335855 -1.844216
H  -2.115196 2.264825 0.189354
H  -2.022683 -2.774263 -0.294351
H  -4.259381 0.970547 -0.065238
H  0.946986 2.903285 -2.288605
H  -4.214408 -1.517192 -0.295645
H  2.337148 -2.562152 -0.817261
