program: Gaussian 09
title: 000154316
version: EM64L-G09RevD.01
frameworkgroup: C1[X(C12H12O5)]
method: RPBEPBE
basis: SDD
operation: Freq
keyword: #pfreq=noraman
keyword: PBEPBE/SDD
title: #p freq=noraman PBEPBE/SDD
converged: YES YES NO NO
title: Mulliken charges:
elementType: O O O O O C C C C C C C C C C C C H H H H H H H H H H H H
charge: -0.161885 -0.243429 -0.147992 -0.281194 -0.230744 0.051758 0.189968 0.325131 -0.722220 0.227597 -0.706195 -0.477523 -0.326456 0.352148 -0.380830 0.259651 -0.749174 0.243678 0.230870 0.237218 0.232182 0.233404 0.256556 0.310768 0.260464 0.261471 0.254276 0.247983 0.252518
chargesum: 0.00000
title: Mulliken charges with hydrogens summed into heavy atoms:
elementType: O O O O O C C C C C C C C C C C C
charge: -0.161885 -0.243429 -0.147992 -0.281194 -0.230744 0.051758 0.189968 0.325131 -0.010455 0.227597 0.015947 -0.166755 -0.065992 0.352148 -0.119359 0.259651 0.005603
polarizability: 2.08977074e+02 1.14450486e+00 1.47108794e+02 -1.72882613e+00 -4.08483043e-01 8.75935435e+01
1716.lowfreq: -7.7509 -0.0008 -0.0006 -0.0004 1.1047 6.8325 28.8019 36.3529 61.8782
frequency: 28.7856 36.2349 61.8762 79.4565 106.5899 115.1774 147.5136 177.6084 183.2072 216.7676 226.7232 255.8297 275.1938 308.6011 339.9461 351.4818 366.2481 413.7975 450.5422 476.5638 528.2691 543.3937 552.5204 575.1576 604.9488 638.1804 647.1807 678.8142 734.0684 741.4440 763.7274 801.9860 815.2514 828.9548 834.9212 852.5524 867.4639 919.8127 923.8946 953.5630 997.1682 1039.5376 1050.1075 1067.9830 1089.0931 1110.0972 1117.5170 1136.6482 1159.1982 1181.3522 1219.5478 1255.5532 1284.6285 1298.7507 1382.0664 1385.3326 1391.5060 1397.5138 1437.5331 1451.1035 1451.8654 1453.9865 1455.6871 1459.9085 1465.3286 1472.1884 1610.9487 1615.6075 1656.4586 2993.7137 3005.5784 3008.6436 3085.3044 3096.5551 3102.7906 3105.3959 3117.2027 3145.1426 3164.7944 3185.5536 3202.4790
redmass: 7.0728 4.3544 2.1568 1.4495 4.6462 4.7712 2.9532 1.3494 1.2367 4.1697 1.8880 3.9073 4.7591 4.5119 3.6646 4.3955 5.7634 6.8540 3.2343 4.6234 4.7002 4.7699 3.2260 4.4590 4.5546 8.0140 5.6812 5.9422 5.1736 5.5080 3.9562 10.6115 4.5742 1.6236 2.9779 3.4105 3.4578 1.4552 3.0968 1.3495 1.8928 1.6356 2.4951 1.9830 1.9200 2.3489 1.5336 2.5799 2.3346 3.7119 4.9033 1.8648 2.6819 4.4966 2.4438 1.6106 1.4012 1.3151 2.9223 1.1171 1.0917 1.0468 1.3827 1.6994 1.1402 1.0531 8.6011 7.6557 9.5423 1.0364 1.0361 1.0368 1.0986 1.0974 1.0991 1.1003 1.1006 1.1011 1.0890 1.0974 1.0936
irintensity: 2.5558 2.8578 1.0970 0.2499 2.6975 2.2935 1.7819 0.0200 0.7821 1.3323 0.4217 1.1806 3.4875 1.7543 3.4354 2.1986 2.9639 5.7116 9.3797 7.0771 3.4980 8.7620 2.5938 16.8340 3.2120 3.8495 1.7463 2.8029 4.0566 7.7033 21.3906 1.9431 6.4859 51.9527 94.7066 25.7851 92.7919 22.8621 13.5844 0.0106 128.6579 9.1376 10.6372 15.6597 143.2241 31.0852 17.9485 62.2360 208.4955 332.8425 11.2111 63.8031 28.8952 29.6700 14.7780 63.4452 9.6098 39.5771 71.9360 7.4411 28.4256 19.0635 46.0999 116.3430 8.3866 19.5621 1.5916 10.6178 174.4821 6.8957 5.6646 1.4316 9.9174 6.3359 8.6388 14.5931 14.2236 9.4215 2.9078 2.6201 4.6520
temp: 298.150 k
press: 1.00000 atm
elementType: 8 8 8 8 8 6 6 6 6 6 6 6 6 6 6 6 6 1 1 1 1 1 1 1 1 1 1 1 1
symmnumber: 1
zpe: 566620.9 jmol-1
zpe.correction: 0.215815 hartree
zpe.thermalcorrener: 0.232069 hartree
zpe.thermalcorrenthalpy: 0.233013 hartree
zpe.thermalcorrgfe: 0.171216 hartree
zpe.sumelectzpe: -839.256131 hartree
zpe.sumelectthermal: -839.239876 hartree
zpe.sumelectthermalent: -839.238932 hartree
zpe.sumelectthermalfe: -839.300729 hartree
dipole: -1.9358 0.9196 -3.3556
dipole: 3.9816
quadrupole: -82.6185 -97.2184 -103.3241
quadrupole: -7.4310 -12.0329 2.6336
quadrupole: 11.7685 -2.8314 -8.9371 -7.4310 -12.0329 2.6336
hfenergy: -839.4719452 hartree
pointgroup: C01 [X(C12H12O5)]
dipole: 0.8564997 -0.3990923 -1.2493943 debye
polarizability: 208.0382066|5.1704297|147.2940032|8.4092569|-3.0356177|88.347201 unknown
InChI: InChI=1S/C12H12O5/c1-7(13)14-8-4-5-10-9(6-8)11(2)12(3,15-10)17-16-11/h4-6H,1-3H3
charge 0 multiplicity 1
29 atoms
O  -2.261774 1.404077 1.197591
O  -2.228488 -1.446884 -0.245256
O  -3.33374 0.247957 1.148566
O  3.229793 -0.242384 0.263122
O  3.298623 2.07653 -0.149824
C  -1.761306 0.971956 -0.197732
C  -2.891548 -0.122069 -0.234215
C  -0.497362 0.15352 -0.093811
C  -1.770275 2.161921 -1.139073
C  -0.843285 -1.216055 -0.071264
C  -4.050288 -0.150258 -1.201589
C  0.843984 0.563847 -0.002312
C  0.118417 -2.229194 0.057148
C  1.821099 -0.455348 0.125633
C  1.467899 -1.826751 0.159386
C  3.877278 1.004232 0.120184
C  5.359726 0.81361 0.348418
H  -1.031089 2.912788 -0.806581
H  -1.500989 1.855136 -2.16555
H  -2.762406 2.642358 -1.150425
H  -4.556697 0.828209 -1.22052
H  -3.707725 -0.410372 -2.217275
H  -4.777905 -0.913744 -0.87566
H  1.131133 1.615464 -0.023783
H  -0.165816 -3.284013 0.076524
H  2.265926 -2.567044 0.266862
H  5.539648 0.419043 1.363527
H  5.877096 1.775775 0.226594
H  5.764471 0.076492 -0.366285
