program: Gaussian 09
title: 000154309
version: EM64L-G09RevD.01
frameworkgroup: C1[X(C9H8O3)]
method: RPBEPBE
basis: SDD
operation: Freq
keyword: #p
keyword: freq=noraman
keyword: PBEPBE/SDD
title: #p freq=noraman PBEPBE/SDD
converged: YES YES NO NO
title: Mulliken charges:
elementType: O O O C C C C C C C C C H H H H H H H H
charge: -0.163172 -0.233591 -0.139892 0.099271 -0.140552 0.292712 -0.728877 0.226329 -0.373903 -0.338144 -0.241937 -0.195310 0.254745 0.245240 0.233466 0.235629 0.243760 0.257983 0.232006 0.234238
chargesum: 0.00000
title: Mulliken charges with hydrogens summed into heavy atoms:
elementType: O O O C C C C C C C C C
charge: -0.163172 -0.233591 -0.139892 0.099271 0.114193 0.292712 -0.014543 0.226329 -0.130143 -0.080161 -0.009931 0.038928
polarizability: 1.33531289e+02 -1.10471804e+00 1.04995232e+02 -3.38067840e+00 5.40812367e+00 6.17194546e+01
1716.lowfreq: -7.9603 0.0002 0.0003 0.0005 9.9509 12.5067 73.6061 115.9973 175.2686
frequency: 73.5808 115.9961 175.2678 206.8383 229.9603 285.1171 334.9029 374.9312 442.1877 488.9653 509.6955 548.3940 561.0372 641.4566 661.0889 737.6501 759.8504 769.0077 774.9010 791.7467 822.1091 864.7686 884.5666 919.4051 930.6222 942.9343 981.0710 1014.3091 1056.7731 1082.5455 1112.9619 1143.4582 1169.3003 1181.1943 1218.8142 1281.4893 1288.6548 1317.6276 1392.0284 1396.8989 1444.4505 1457.7192 1464.1385 1468.8704 1604.0409 1622.7164 2992.1469 3084.7886 3103.4428 3106.1020 3135.4909 3145.1478 3166.0276 3181.0465
redmass: 6.6644 4.7241 3.0118 1.2416 3.6494 3.2678 4.2446 6.1893 3.4268 4.5503 5.8199 6.1400 4.1342 8.8953 5.6632 4.9104 1.3371 5.4662 3.4775 8.8740 4.1720 1.3923 2.5653 3.4171 6.6638 1.4580 1.3163 2.1643 3.1936 2.2273 1.7062 2.0908 1.2515 1.6898 2.0426 1.5501 1.6731 2.1713 1.2578 6.4904 2.1124 1.4357 1.8812 1.0605 7.1466 7.9027 1.0362 1.0987 1.0993 1.0913 1.0865 1.0912 1.0964 1.0980
irintensity: 0.5722 3.3956 0.7770 0.3560 0.5890 0.3734 1.4399 6.7497 9.3007 3.4561 7.5941 4.8344 5.5223 1.4540 4.5895 0.9269 94.6857 1.5652 10.9388 0.9155 26.0367 1.8947 49.3401 51.2650 117.0641 10.5272 0.1618 9.9930 6.4317 46.1746 6.7568 13.9656 1.2646 26.1970 2.9145 4.1315 20.4746 15.5389 24.3976 7.6094 61.9274 3.9120 10.8135 10.9139 11.8418 40.9749 8.7327 10.5865 8.3510 32.2864 0.1800 12.1722 19.9142 7.0872
temp: 298.150 k
press: 1.00000 atm
elementType: 8 8 8 6 6 6 6 6 6 6 6 6 1 1 1 1 1 1 1 1
symmnumber: 1
zpe: 391539.2 jmol-1
zpe.correction: 0.149129 hartree
zpe.thermalcorrener: 0.158718 hartree
zpe.thermalcorrenthalpy: 0.159662 hartree
zpe.thermalcorrgfe: 0.114290 hartree
zpe.sumelectzpe: -572.453188 hartree
zpe.sumelectthermal: -572.443599 hartree
zpe.sumelectthermalent: -572.442655 hartree
zpe.sumelectthermalfe: -572.488027 hartree
dipole: -1.8714 2.2344 -2.9557
dipole: 4.1510
quadrupole: -63.4641 -65.6758 -73.7412
quadrupole: 2.4852 -8.5646 0.6132
quadrupole: 4.1630 1.9513 -6.1142 2.4852 -8.5646 0.6132
hfenergy: -572.6023171 hartree
pointgroup: C01 [X(C9H8O3)]
dipole: 0.7833481 0.8312929 1.1672215 debye
dipolederiv: -0.455475 -0.069517 -0.0302807 0.0908738 -0.2236937 -0.0494927 -0.1989034 -0.183314 -0.2975219 -1.3258503 -0.1953957 0.0324219 -0.101142 -0.4900222 0.1148926 0.2529269 0.1006818 -0.3297661 -0.3672607 0.0876409 -0.0360627 -0.0313918 -0.1487835 -0.0287237 -0.1521352 0.1387573 -0.3643133 0.729911 -0.0988715 -0.0467114 -0.0563812 0.2071555 0.1455832 0.0718806 0.331504 0.4102571 1.06977 -0.1275121 0.0529015 -0.3903776 0.2900522 -0.0719079 0.0696979 -0.252301 0.5441938 -0.3026557 0.1055657 0.0133499 -0.2121268 -0.229098 0.0293566 0.1850107 -0.0605556 -0.1603279 -0.0597546 0.0571917 0.0528747 0.0734657 -0.0731285 -0.0974959 -0.00172 -0.093025 -0.0353286 0.7928968 0.36618 -0.136398 0.5111251 0.3283327 -0.0880026 -0.2692169 -0.0695488 0.1242006 0.1859033 -0.0923896 -0.0218798 0.0984624 0.112759 -0.0297457 -0.0244476 -0.0322376 -0.0964489 -0.2842147 -0.2078929 0.0514536 -0.0511835 0.0332681 -0.0310967 0.0094116 0.0072317 -0.1643678 -0.139449 0.1325221 -0.0314385 0.1670552 -0.1052932 -0.0290177 -0.027238 -0.0323425 -0.1730731 0.1122215 0.0306825 -0.0452992 -0.080091 0.1354052 -0.0293181 -0.0286353 -0.0417283 -0.1235934 -0.0363407 -0.0169115 0.0653723 -0.0186768 0.082643 0.0430598 0.0591534 0.0474119 -0.0384574 -0.1230768 0.0172444 0.0413569 -0.0164955 0.0785235 -0.0177923 0.0198338 -0.0173645 0.0926138 0.0654792 0.0162504 -0.0830485 0.0071993 0.0820046 0.0180085 -0.0719501 -0.0176931 -0.0713698 0.0916351 -0.0648154 0.0456455 -0.0204008 -0.0545281 0.042469 0.0348494 0.0857277 0.0550247 0.081481 0.0688114 -0.0011524 0.0341696 -0.0661302 0.017144 -0.0083963 0.0197418 0.1443677 0.0920862 0.0243029 0.0106428 0.0411557 -0.0393347 0.024383 0.0079126 0.0304683 0.1719996 -0.0267677 -0.0887203 0.0379646 -0.098682 0.000151 0.0352807 0.0397101 0.0361357 0.1582232 -0.1005391 0.055634 0.0282874 0.0534422 0.0797173 0.0024161 0.0322558 0.0024501 0.1536879 unknown
polarizability: 133.3316956|0.5651287|105.2363647|-5.3466481|-4.1035709|61.6779153 unknown
InChI: InChI=1S/C9H8O3/c1-9-6-4-2-3-5-7(6)10-8(9)11-12-9/h2-5,8H,1H3
charge 0 multiplicity 1
20 atoms
O  -1.958215 0.571236 -1.118514
O  -0.465599 -1.70639 0.555403
O  -2.352716 -0.932666 -0.837335
C  -1.237639 0.606815 0.254779
C  -1.669122 -0.87562 0.480892
C  0.258715 0.496883 0.095251
C  -1.800001 1.732069 1.103319
C  0.632046 -0.862113 0.224685
C  1.241667 1.468613 -0.163561
C  1.954831 -1.304426 0.097133
C  2.589371 1.052044 -0.300273
C  2.935369 -0.31668 -0.172972
H  -2.342435 -1.191817 1.290076
H  -2.897867 1.654671 1.170719
H  -1.369686 1.708906 2.120604
H  -1.553278 2.710118 0.652369
H  0.973165 2.525112 -0.272011
H  2.212307 -2.361539 0.201726
H  3.369402 1.790664 -0.51076
H  3.981585 -0.621882 -0.284029
