program: Gaussian 09
title: 000154288
version: EM64L-G09RevD.01
frameworkgroup: C1[X(C8H12Br2O6)]
method: RPBEPBE
basis: SDD
operation: Freq
keyword: #p
keyword: freq=noraman
keyword: PBEPBE/SDD
title: #p freq=noraman PBEPBE/SDD
converged: YES YES NO NO
title: Mulliken charges:
elementType: Br Br O O O O O O C C C C C C C C H H H H H H H H H H H H
charge: -0.003041 -0.002328 -0.445157 -0.446722 -0.247452 -0.246833 -0.233737 -0.234977 -0.193814 -0.193584 0.245991 0.245811 -0.196936 -0.197120 -0.673109 -0.673339 0.285783 0.284574 0.246760 0.269590 0.247072 0.269571 0.373767 0.374310 0.278563 0.293838 0.278700 0.293819
chargesum: 0.00000
title: Mulliken charges with hydrogens summed into heavy atoms:
elementType: Br Br O O O O O O C C C C C C C C
charge: -0.003041 -0.002328 -0.071390 -0.072412 -0.247452 -0.246833 -0.233737 -0.234977 0.091969 0.090990 0.245991 0.245811 0.319414 0.319523 -0.100708 -0.100819
polarizability: 1.34330179e+02 1.29749310e-02 1.21278395e+02 5.27081227e+00 -3.42035041e-01 1.43299170e+02
1716.lowfreq: -0.0007 -0.0007 -0.0006 1.7209 3.4029 8.0378 9.3325 17.8618 22.4559
frequency: 9.0482 17.8137 22.2169 27.2450 39.9282 65.3761 70.2753 91.4296 121.3302 132.0613 141.9945 179.3004 204.8982 221.1019 228.1876 254.8597 256.3711 312.9090 320.0718 370.3358 387.2936 423.9103 432.2874 459.9329 535.4969 538.1559 560.5080 579.0138 681.9700 750.7493 777.1812 800.8096 806.5830 849.5061 900.3674 919.1525 920.1347 960.5310 967.1067 979.1759 1025.3886 1040.5882 1073.2895 1073.7674 1151.8705 1165.5214 1166.8227 1178.6555 1210.3303 1210.7390 1217.7461 1243.9508 1264.9661 1276.4610 1276.6224 1308.6037 1360.6460 1362.3249 1375.3951 1388.3387 1432.0938 1432.4022 1453.0861 1453.1762 1634.1913 1635.7942 2998.6768 2998.8033 3045.4313 3055.3811 3063.0209 3063.3085 3083.6541 3084.0441 3148.0451 3148.3813 3483.9840 3488.6382
redmass: 14.7445 10.6390 12.0623 5.4790 5.5832 12.0276 7.4067 7.3634 7.8799 3.9060 4.5312 8.9496 7.7967 1.6394 5.2692 2.2308 2.2699 5.7919 2.6518 4.5810 3.8992 4.1337 1.4031 2.7024 4.0572 3.8982 8.5462 6.1257 4.7544 4.0593 3.4826 3.4723 3.2116 5.1711 5.7471 2.3421 2.3294 1.9146 1.5772 2.3484 4.1607 4.6783 2.3981 2.3929 2.4105 1.2690 1.2391 3.0021 1.1956 1.2012 1.5321 1.2733 1.4906 1.1890 1.1926 1.4053 1.2649 1.3488 1.3805 1.4885 1.1156 1.1162 1.0778 1.0778 10.4621 10.5576 1.0613 1.0612 1.0843 1.0855 1.0598 1.0598 1.1003 1.1002 1.1098 1.1097 1.0652 1.0650
irintensity: 0.6067 1.1230 0.2157 3.6953 2.3398 0.4762 15.0568 7.9094 0.5948 0.9774 2.1044 0.8984 0.9659 129.1978 21.4755 0.8936 16.3273 30.6744 85.8784 12.1399 4.0756 34.6002 28.2400 0.1604 12.2325 7.5609 29.7877 23.3358 13.4002 7.3962 0.8858 8.2976 10.3068 5.1429 0.7486 52.5448 0.8036 4.2547 21.5329 0.9557 164.0303 188.4170 30.8295 30.5240 248.3898 9.5432 11.4515 244.2349 3.0815 5.0629 336.3787 50.7914 30.1627 71.6516 3.5549 8.7029 3.2691 1.1005 19.1257 29.6400 6.4358 19.3522 10.3827 25.2215 135.2167 238.8579 21.8755 5.4975 4.1774 14.8595 12.4418 10.6047 8.8718 8.8869 4.2338 3.9598 49.2920 30.1470
temp: 298.150 k
press: 1.00000 atm
elementType: 35 35 8 8 8 8 8 8 6 6 6 6 6 6 6 6 1 1 1 1 1 1 1 1 1 1 1 1
symmnumber: 1
zpe: 528694.2 jmol-1
zpe.correction: 0.201369 hartree
zpe.thermalcorrener: 0.220392 hartree
zpe.thermalcorrenthalpy: 0.221336 hartree
zpe.thermalcorrgfe: 0.146861 hartree
zpe.sumelectzpe: -789.033942 hartree
zpe.sumelectthermal: -789.014919 hartree
zpe.sumelectthermalent: -789.013975 hartree
zpe.sumelectthermalfe: -789.088450 hartree
dipole: -0.0365 -2.8218 -0.0462
dipole: 2.8224
quadrupole: -100.6606 -120.7898 -109.6827
quadrupole: -0.1749 22.0579 -0.1731
quadrupole: 9.7172 -10.4121 0.6950 -0.1749 22.0579 -0.1731
hfenergy: -789.2353114 hartree
pointgroup: C01 [X(C8H12Br2O6)]
dipole: -0.0209375 -1.1090835 0.0500006 debye
polarizability: 137.6332167|0.2802967|121.300633|6.8133332|0.7274339|139.973893 unknown
InChI: InChI=1S/C8H12Br2O6/c9-1-3-15-7(13)5(11)6(12)8(14)16-4-2-10/h5-6,11-12H,1-4H2
charge 0 multiplicity 1
28 atoms
Br 3.752971 -2.268083 -1.915751
Br -3.752689 -2.037917 2.019639
O  -0.398393 1.895998 1.259306
O  0.420576 1.740771 -1.581569
O  2.262207 -0.484173 0.461939
O  -2.257872 -0.51601 -0.526765
O  2.344482 1.715687 1.241464
O  -2.320891 1.578788 -1.55707
C  0.178519 0.708309 0.664417
C  -0.164404 0.626853 -0.86389
C  1.698841 0.72348 0.834497
C  -1.684481 0.634879 -1.03581
C  3.749476 -0.545097 0.478963
C  -3.74576 -0.567344 -0.53702
C  4.156438 -1.93782 0.039503
C  -4.161035 -1.905454 0.042513
H  -0.249114 -0.176556 1.167297
H  0.255354 -0.31104 -1.268268
H  4.096748 -0.355836 1.514006
H  4.148907 0.246216 -0.178119
H  -4.093183 -0.481177 -1.585611
H  -4.137704 0.289578 0.037214
H  0.314173 2.590246 1.307373
H  -0.295409 2.416653 -1.733436
H  5.244289 -2.074559 0.137182
H  3.613044 -2.720064 0.58935
H  -5.2501 -2.04378 -0.037969
H  -3.62469 -2.743149 -0.426782
