program: Gaussian 09
title: 000154258
version: EM64L-G09RevD.01
frameworkgroup: C1[X(C9H5FN2O3)]
method: RPBEPBE
basis: SDD
operation: Freq
keyword: #p
keyword: freq=noraman
keyword: PBEPBE/SDD
title: #p freq=noraman PBEPBE/SDD
converged: NO NO NO NO
title: Mulliken charges:
elementType: F O O O N N C C C C C C C C C H H H H H
charge: -0.131580 -0.283596 -0.206084 -0.218803 -0.041534 0.022738 0.312844 0.091013 0.244440 0.215696 -0.305366 -0.373144 -0.345725 -0.162462 -0.253429 0.324126 0.300378 0.276550 0.243525 0.290413
chargesum: 0.00000
title: Mulliken charges with hydrogens summed into heavy atoms:
elementType: F O O O N N C C C C C C C C C
charge: -0.131580 -0.283596 -0.206084 -0.218803 -0.041534 0.022738 0.312844 0.091013 0.244440 0.215696 0.018760 -0.072765 -0.069176 0.081063 0.036984
polarizability: 2.08453698e+02 -7.86019968e+00 1.62945503e+02 1.33978543e-02 1.14971128e-02 4.57277599e+01
1716.lowfreq: -11.7685 0.0006 0.0008 0.0010 2.2418 4.8446 19.1187 48.5606 87.0268
frequency: 18.3275 48.4146 87.0206 162.3837 233.0535 241.5229 284.3181 316.2871 321.5778 366.9933 388.1568 467.7806 476.3356 481.8834 534.2603 585.6422 604.7022 611.8100 619.8089 660.9112 692.7643 725.0612 753.1560 775.3946 803.0998 841.4094 877.8750 897.6852 983.4581 984.4247 1027.7636 1066.5562 1113.9200 1148.9555 1171.7993 1182.7338 1191.1813 1234.5000 1266.1155 1277.5343 1338.5982 1369.8785 1396.7223 1410.1590 1428.7954 1539.0946 1548.2648 1591.8164 1603.2382 3171.3550 3179.9846 3196.0980 3213.4321 3234.8728
redmass: 14.0398 9.9667 9.0134 4.2031 9.6231 5.3661 13.1918 6.9971 13.8367 12.7081 10.8434 3.6293 6.9137 4.5344 8.4128 6.7608 6.1815 6.2651 3.5852 8.7309 6.9495 3.7892 9.7696 5.9163 1.5681 1.4356 7.7789 1.3922 1.3141 1.3292 4.4552 2.5886 2.7393 1.8064 1.6086 2.4534 2.6450 5.5955 2.5404 3.3750 5.4008 3.6326 3.0073 4.4336 2.9370 4.4646 6.0801 7.4499 8.2405 1.0909 1.0894 1.0967 1.0958 1.0943
irintensity: 0.0763 6.2480 4.3849 2.3336 7.1495 0.2406 4.0269 1.0380 1.8691 0.8124 3.8454 0.0021 2.8437 0.0071 8.8038 2.2475 1.6954 1.4387 0.2541 9.2141 13.1969 8.1865 5.3647 16.0011 80.9335 50.3615 7.4232 0.0542 1.7900 3.2508 68.0083 12.9333 3.5893 28.9640 171.0582 222.9449 146.6100 25.7396 37.0513 8.7902 85.7902 44.5998 28.2439 28.8738 22.3820 16.3762 46.9604 170.5110 46.7858 5.0157 0.3316 5.0347 1.3622 12.8090
temp: 298.150 k
press: 1.00000 atm
elementType: 9 8 8 8 7 7 6 6 6 6 6 6 6 6 6 1 1 1 1 1
symmnumber: 1
zpe: 339433.7 jmol-1
zpe.correction: 0.129283 hartree
zpe.thermalcorrener: 0.140820 hartree
zpe.thermalcorrenthalpy: 0.141765 hartree
zpe.thermalcorrgfe: 0.089934 hartree
zpe.sumelectzpe: -779.782805 hartree
zpe.sumelectthermal: -779.771268 hartree
zpe.sumelectthermalent: -779.770324 hartree
zpe.sumelectthermalfe: -779.822154 hartree
dipole: -0.8884 0.7980 0.0021
dipole: 1.1942
quadrupole: -113.5854 -69.6958 -84.6898
quadrupole: -12.0102 -0.0036 0.0016
quadrupole: -24.2617 19.6279 4.6339 -12.0102 -0.0036 0.0016
hfenergy: -779.9120884 hartree
pointgroup: C01 [X(C9H5F1N2O3)]
dipole: -0.3500834 0.3133253 0.0008103 debye
dipolederiv: -0.6583623 -0.4154448 0.00012 -0.4044397 -0.4778238 0.0000378 0.0000904 0.0000488 -0.099612 -0.9630354 -0.1764206 -0.0002372 -0.2938481 -0.324854 -0.0001103 -0.0005429 -0.0001782 -0.2737125 -1.0966117 0.2246085 0.0000063 0.385162 -0.5192677 0.0000328 0.00019 -0.000055 -0.2308558 -0.5377184 -0.1154638 0.000011 -0.3938727 -0.7253933 -0.0000118 0.000059 0.0000582 -0.2320036 0.856413 0.1807668 0.0004243 0.528219 0.2522197 0.0002685 0.0007064 0.0002607 0.1180277 2.1334718 0.0537539 -0.0000696 0.3732109 1.0076944 -0.0000524 -0.0002567 -0.0000207 0.1924274 0.074337 -0.0041804 -0.0000316 -0.5642529 0.3219459 0.0000318 -0.0001117 0.0001403 0.1001338 -0.175587 -0.2119811 -0.0001183 0.255993 -0.2460422 0.0000397 -0.0000003 -0.0001638 0.0019323 -0.8543968 -0.0317391 0.000046 -0.4876626 -0.2713197 0.0000063 0.0000601 -0.0000275 0.0124947 1.0154105 0.4656053 -0.0001535 -0.1095558 0.7338775 -0.0000961 -0.0001369 -0.0000108 0.1503217 -0.3261777 0.144667 -0.0000347 0.4596679 -0.322059 0.0000163 0.0000298 -0.0000637 -0.1686264 0.3784916 0.0758387 0.0000018 0.5098968 0.1629151 0.0000088 -0.0000602 0.0000225 -0.0632286 -0.7724132 -0.0993166 0.0000019 0.2087463 0.0075826 0.0000099 0.0000081 -0.0000185 -0.1773673 0.5007309 -0.0994537 0.000077 0.084004 0.2026107 0.0000874 0.0001359 0.0001009 -0.078276 -0.0343828 0.0279338 0.0000068 -0.5416455 -0.1069099 -0.0001932 -0.0001511 -0.0000469 -0.1280515 0.1247137 -0.0797902 -0.0000195 0.0106143 0.1269885 -0.0000098 0.0000124 -0.0000115 0.1820622 0.0894975 0.053047 0.0000051 0.004695 0.1268121 -0.0000038 0.0000085 -0.0000002 0.1671965 0.0867695 -0.0164325 0.0000063 -0.0207595 0.0108129 0.0000034 0.0000306 0.0000181 0.183457 0.1179179 0.0023698 -0.0000042 0.0160281 -0.0517707 -0.0000428 0.0000343 -0.0000433 0.1554774 0.0409319 0.0216319 -0.0000381 -0.0202004 0.0919809 -0.0000225 -0.0001057 -0.0000094 0.188203 unknown
polarizability: 208.4823593|-7.7767336|162.9168417|0.0133768|0.0115217|45.7277599 unknown
InChI: InChI=1S/C9H5FN2O3/c10-7-3-4-8(12(14)15)6-2-1-5-11(13)9(6)7/h1-5H
charge 0 multiplicity 1
20 atoms
F  -2.252572 -2.322713 0.000164
O  -3.418914 -0.01052 -0.001064
O  3.809527 -0.667613 -0.000137
O  3.035802 1.466367 -0.000089
N  -2.230913 0.578994 -0.000157
N  2.83671 0.187479 0.000071
C  0.270913 0.495239 0.000232
C  -1.018923 -0.187119 0.000055
C  1.450765 -0.348573 0.000145
C  -1.060091 -1.616194 0.000101
C  0.283441 1.925667 0.000515
C  1.361719 -1.747352 0.000045
C  0.106934 -2.385538 0.000052
C  -0.929772 2.625693 0.000513
C  -2.161163 1.958112 0.000129
H  1.235199 2.450177 0.000638
H  2.286299 -2.32895 -0.000039
H  0.021619 -3.475009 0.000065
H  -0.934805 3.719048 0.000735
H  -3.134678 2.449505 -0.000075
