program: Gaussian 09
title: 000154250
version: EM64L-G09RevD.01
frameworkgroup: C1[X(C9H5FN2O2)]
method: RPBEPBE
basis: SDD
operation: Freq
keyword: #p
keyword: freq=noraman
keyword: PBEPBE/SDD
title: #p freq=noraman PBEPBE/SDD
converged: NO YES NO YES
title: Mulliken charges:
elementType: F O O N N C C C C C C C C C H H H H H
charge: -0.182589 -0.220022 -0.149611 0.050188 0.018656 0.454621 -0.129345 0.318614 -0.396269 -0.417404 -0.363952 -0.223983 0.344480 -0.449059 0.247174 0.277420 0.298398 0.247377 0.275305
chargesum: 0.00000
title: Mulliken charges with hydrogens summed into heavy atoms:
elementType: F O O N N C C C C C C C C C
charge: -0.182589 -0.220022 -0.149611 0.050188 0.018656 0.454621 -0.129345 0.318614 -0.149095 -0.139984 -0.065554 0.023395 0.344480 -0.173754
polarizability: 1.75484450e+02 -1.23908133e+01 1.45551786e+02 -8.61146633e-03 7.72607277e-03 4.45591457e+01
1716.lowfreq: -73.4105 -8.9488 -5.9990 -4.6583 0.0004 0.0007 0.0009 69.2422 128.1943
frequency: -73.4082 69.2415 128.1942 181.1881 217.1790 297.1063 304.9151 353.8603 374.6622 413.4487 438.1454 499.0542 513.6881 525.8854 543.2563 623.2160 630.7416 685.4626 696.2625 737.5087 778.2758 818.8800 821.0788 896.9905 910.5280 936.3653 956.0214 971.6075 1003.2102 1078.4483 1139.7761 1165.9860 1177.7211 1185.5804 1206.3293 1249.0973 1346.1474 1359.0628 1376.0185 1381.3244 1419.6397 1444.5381 1492.4877 1549.9775 1604.6836 1620.1418 3137.5410 3143.0324 3166.1384 3167.1286 3187.6795
redmass: 12.7743 9.3436 5.5972 12.9254 4.3108 9.9039 5.8342 12.2982 8.8887 4.6256 6.0191 3.3305 5.0500 7.1600 7.8839 2.9157 7.9530 9.1492 6.9086 9.0773 2.2822 6.5256 1.9450 1.5849 1.4562 5.6955 1.4086 5.9298 1.3653 2.0886 1.9192 1.9930 2.2773 4.3719 2.1166 1.8609 2.7196 2.4304 3.7397 11.3417 4.8539 2.6889 4.6181 7.4933 6.5089 7.2595 1.0893 1.0922 1.0942 1.0937 1.0952
irintensity: 0.2518 0.3173 0.2424 0.4768 0.1342 0.2771 4.6602 2.2560 0.5931 1.1314 8.5976 6.5259 3.8500 1.6052 6.7080 0.0969 12.8736 10.4084 6.3495 20.9978 41.7206 11.8182 6.6811 56.2764 8.0559 36.2196 0.5024 4.8700 3.4867 9.8743 45.2925 6.7687 116.8402 159.9185 14.1479 58.8387 0.7371 10.5038 30.9093 100.4752 12.4637 42.8716 35.5501 5.4528 40.4033 4.5643 3.5107 7.6985 11.7500 2.1361 6.1342
temp: 298.150 k
press: 1.00000 atm
elementType: 9 8 8 7 7 6 6 6 6 6 6 6 6 6 1 1 1 1 1
symmnumber: 1
zpe: 328521.2 jmol-1
zpe.correction: 0.125127 hartree
zpe.thermalcorrener: 0.134825 hartree
zpe.thermalcorrenthalpy: 0.135769 hartree
zpe.thermalcorrgfe: 0.089467 hartree
zpe.sumelectzpe: -704.684076 hartree
zpe.sumelectthermal: -704.674378 hartree
zpe.sumelectthermalent: -704.673434 hartree
zpe.sumelectthermalfe: -704.719736 hartree
dipole: 3.0517 5.6812 0.0008
dipole: 6.4489
quadrupole: -91.1822 -73.0385 -79.3547
quadrupole: -7.5327 -0.0004 -0.0063
quadrupole: -9.9904 8.1533 1.8371 -7.5327 -0.0004 -0.0063
hfenergy: -704.8092036 hartree
pointgroup: C01 [X(C9H5F1N2O2)]
dipole: -1.1579582 2.2575562 -0.0003277 debye
dipolederiv: -1.2816455 -0.2707146 0.0000405 -0.1202357 -0.2044698 -0.0000085 0.0000632 0.0000122 -0.1440935 -0.9782328 0.0131973 0.0006767 0.0899037 -0.4667033 0.0003201 0.0000219 0.0001701 -0.2434172 -0.4560544 0.065045 0.0000497 0.0155804 -0.7168879 0.0003727 0.0003603 0.0007085 -0.1818415 -0.3916866 0.0249399 0.0000494 -0.075362 -0.1153466 -0.0000388 -0.0000938 -0.0000758 -0.205091 1.4772024 -0.2697252 -0.0007961 -0.4428056 1.2735056 -0.0009313 -0.0006261 -0.0007193 0.1842983 0.0165794 -0.003482 -0.0000166 0.1352427 -0.1943524 -0.000068 0.0000097 -0.000033 0.0749021 0.3074285 0.0344683 0.0001043 0.1690425 -0.0849394 0.0000875 0.0000291 0.0000532 0.0347424 -0.1576952 0.1884831 0.0000418 0.3798892 -0.3217422 0.0002054 0.0001394 0.0000038 0.0729662 0.1433471 -0.0765796 -0.0000353 0.0173804 0.1266217 0.0000538 -0.000002 0.0000424 -0.1362538 -0.087385 0.0422297 0.0000092 -0.2331836 0.0575113 0.0000346 -0.0000408 0.0000346 -0.1415922 -0.0222422 0.0112883 -0.0000568 -0.3575353 0.017971 0.0000238 0.0001717 -0.0001955 -0.1008385 -0.2927506 0.1244958 -0.0000004 0.1758389 0.1632774 0.0000238 0.0000437 -0.0000118 -0.1359115 1.4275277 0.3204754 -0.0000409 0.0821135 -0.0514816 -0.0000439 -0.0001073 -0.0001098 0.1585104 0.0397599 -0.1878319 -0.0000333 0.1776742 0.416252 0.0000826 0.000083 0.0001138 -0.0329855 0.0227844 0.1108372 0.0000234 0.0449959 -0.0146281 -0.0000306 0.0000191 -0.0000291 0.1576932 0.0660079 0.0212325 0.0000112 0.0776714 0.0225337 -0.0000294 0.0000256 -0.000014 0.1721632 0.0680389 -0.023373 -0.0000055 -0.0047837 0.1481953 -0.0000176 -0.0000321 0.0000635 0.1698914 0.0573572 -0.0670865 -0.0000047 -0.0520372 -0.0559927 -0.0000069 -0.0000522 0.0000042 0.1607025 0.0416591 -0.0578997 -0.0000167 -0.0793897 0.0006758 -0.0000293 -0.0000125 -0.0000179 0.136155 unknown
polarizability: 175.9442092|11.8135121|145.0920276|-0.0087566|-0.0075611|44.5591457 unknown
InChI: InChI=1S/C9H5FN2O2/c10-7-4-6-2-1-3-8(12(13)14)9(6)11-5-7/h1-5H
charge 0 multiplicity 1
19 atoms
F  -4.142882 -0.580688 0.000074
O  3.687796 -0.756258 -0.000624
O  2.024521 -2.301459 0.001782
N  -0.559624 -1.411315 -0.0004
N  2.431212 -1.087385 -0.000242
C  -0.811246 1.057971 0.000084
C  0.010023 -0.147296 -0.00013
C  1.44366 0.043892 -0.000195
C  -0.208769 2.355415 0.00018
C  -2.236602 0.90674 0.000177
C  2.003943 1.327344 -0.00016
C  1.179171 2.48567 0.000024
C  -2.755411 -0.377883 -0.000002
C  -1.898164 -1.517026 -0.000337
H  -0.854233 3.241276 0.000365
H  -2.892898 1.782273 0.000363
H  3.09354 1.411053 -0.000255
H  1.644951 3.475571 0.000075
H  -2.328789 -2.524994 -0.000577
