program: Gaussian 09
title: 000154241
version: EM64L-G09RevD.01
frameworkgroup: C1[X(C18H14BrNO)]
method: RPBEPBE
basis: SDD
operation: Freq
keyword: #p
keyword: freq=noraman
keyword: PBEPBE/SDD
title: #p freq=noraman PBEPBE/SDD
converged: YES YES NO NO
title: Mulliken charges:
elementType: Br O N C C C C C C C C C C C C C C C C C C H H H H H H H H H H H H H H
charge: 0.014513 -0.283288 -0.035229 0.328922 0.201705 0.383187 -0.298055 -0.366772 0.233655 -0.367594 -0.192865 -0.264280 -0.299515 -0.382088 -0.348951 -0.230020 -0.190092 -0.194607 -0.230938 -0.534041 -0.304503 0.261971 0.237179 0.242846 0.245668 0.222129 0.233812 0.224629 0.259239 0.230707 0.249920 0.252754 0.226420 0.226361 0.247219
chargesum: 0.00000
title: Mulliken charges with hydrogens summed into heavy atoms:
elementType: Br O N C C C C C C C C C C C C C C C C C C
charge: 0.014513 -0.283288 -0.035229 0.328922 0.201705 0.383187 -0.036083 -0.129593 0.233655 -0.124748 0.052803 -0.030468 -0.077386 -0.157458 -0.089713 0.000688 0.059829 0.058147 -0.230938 0.165958 -0.304503
polarizability: 6.30766401e+02 1.55413892e+01 2.42717041e+02 5.27121439e-01 2.10036318e-01 8.59765836e+01
1716.lowfreq: -3.7390 -0.0004 0.0004 0.0007 3.5271 8.3656 19.6085 22.8613 29.2390
frequency: 19.5618 22.7540 29.2355 41.1283 69.6624 98.4278 101.6084 118.0235 128.3209 146.5959 189.3049 205.3036 211.1503 239.8132 251.3910 276.9564 305.9943 315.8500 343.6647 353.5552 393.9877 405.2834 452.1624 472.6524 481.8443 501.6211 513.1704 542.4428 567.5477 607.8202 624.7646 645.0922 682.9636 718.1997 738.2948 739.9610 758.3511 771.3412 823.3915 842.1387 855.1734 858.3589 893.2262 914.8645 940.9967 958.3109 968.7291 973.3457 979.4149 986.4435 993.5015 1002.6686 1046.9319 1065.8809 1098.5891 1114.4393 1122.2117 1151.1439 1178.2980 1191.2274 1203.0611 1219.1980 1232.7180 1250.5980 1293.7942 1300.1546 1306.1215 1307.0606 1327.8636 1367.9701 1390.8815 1404.7610 1433.2668 1450.1082 1466.4630 1470.5605 1476.1204 1484.0996 1558.1499 1568.3228 1581.0195 1588.3948 1602.2604 1616.0199 2152.2700 2967.5838 3058.9367 3112.4348 3122.6349 3129.7456 3130.1145 3136.2098 3143.1441 3146.5152 3146.8826 3164.3372 3169.9073 3173.2957 3175.7541
redmass: 3.8463 6.7215 6.9052 5.3233 6.7490 7.7105 3.1985 8.6819 4.7145 9.5230 2.5219 6.9143 2.9023 1.7094 4.6015 2.0794 6.3088 4.8449 4.6211 4.5013 5.5642 2.8694 5.1272 3.0194 7.6352 3.1511 7.1764 3.4229 5.0032 5.2971 7.1672 5.4126 7.1653 3.0886 5.6490 3.3978 1.2627 6.0608 1.3248 1.5468 1.4232 4.6899 1.6119 1.7862 1.3848 1.3650 6.0010 1.3728 1.3313 8.7296 4.2547 1.1317 2.1437 2.5251 2.4576 1.2574 1.4156 1.3609 1.1035 1.4699 1.2923 3.2813 2.0989 1.9741 1.5478 1.9004 1.5054 1.6718 1.6404 5.5304 5.4993 3.3586 1.4027 1.8174 1.5161 1.0500 1.9154 1.6654 5.5653 7.3506 5.5518 5.8395 5.8327 5.3061 12.6350 1.0325 1.1043 1.0922 1.0906 1.0995 1.0866 1.0854 1.0893 1.0877 1.0896 1.0943 1.0956 1.0968 1.0987
irintensity: 0.0291 0.2339 0.2173 0.5317 2.6271 1.0087 6.7278 3.0176 2.3554 0.1103 0.2747 0.4687 0.2917 0.0210 4.9894 0.1653 18.0766 1.0282 0.5885 0.0002 3.4359 0.0041 0.6078 16.9396 0.7866 12.1102 8.1504 1.3074 17.5538 10.6519 0.4810 4.2618 7.0184 1.7656 6.4279 0.4071 95.7765 6.3290 4.4372 64.4133 1.0590 0.2345 2.6550 0.0005 0.1678 0.0580 42.8021 1.1795 3.6842 51.7604 36.6929 64.2649 7.9044 64.2036 26.4820 0.1649 4.5885 6.3407 44.0446 15.5109 0.5215 237.1307 5.0397 34.9067 15.0659 39.2157 1.0691 43.0711 16.2576 40.3911 45.3185 25.1600 23.0389 8.6682 118.7264 14.1601 81.7068 36.3500 45.8791 23.8326 5.3580 8.5355 58.4098 130.7187 78.3865 98.6999 42.1947 0.0724 6.0242 23.7088 35.4605 0.3388 2.7093 2.3080 4.6191 21.4925 8.5950 4.4047 36.8227
temp: 298.150 k
press: 1.00000 atm
elementType: 35 8 7 6 6 6 6 6 6 6 6 6 6 6 6 6 6 6 6 6 6 1 1 1 1 1 1 1 1 1 1 1 1 1 1
symmnumber: 1
zpe: 693079.4 jmol-1
zpe.correction: 0.263980 hartree
zpe.thermalcorrener: 0.283574 hartree
zpe.thermalcorrenthalpy: 0.284518 hartree
zpe.thermalcorrgfe: 0.212224 hartree
zpe.sumelectzpe: -836.252558 hartree
zpe.sumelectthermal: -836.232964 hartree
zpe.sumelectthermalent: -836.232020 hartree
zpe.sumelectthermalfe: -836.304314 hartree
dipole: -5.6605 -4.8957 -0.0143
dipole: 7.4839
quadrupole: -101.5715 -128.3733 -139.5039
quadrupole: 14.1035 0.0013 -0.1167
quadrupole: 21.5780 -5.2237 -16.3543 14.1035 0.0013 -0.1167
hfenergy: -836.516538 hartree
pointgroup: C01 [X(C18H14Br1N1O1)]
dipole: -2.2612784 -1.7577336 0.6829852 debye
polarizability: 630.5120084|1.5215813|225.924974|-21.1547618|-47.7105289|103.0230437 unknown
InChI: InChI=1S/C18H14BrNO/c1-21-18-8-3-2-5-15(18)6-4-7-16(13-20)14-9-11-17(19)12-10-14/h2-12H,1H3
charge 0 multiplicity 1
35 atoms
Br 7.748879 -1.197158 0.080692
O  -3.6728 -2.169666 0.876927
N  1.447949 3.281022 -1.177521
C  -3.176634 0.043167 0.082495
C  -4.169378 -0.927379 0.458357
C  3.200665 0.309046 -0.247486
C  -1.763042 -0.314548 0.154354
C  -3.638997 1.320907 -0.347771
C  1.804144 0.797726 -0.356993
C  -5.548928 -0.620729 0.400937
C  -0.690011 0.498236 -0.161695
C  -5.009686 1.631494 -0.406495
C  0.670693 0.043744 -0.059361
C  3.51067 -1.015208 0.178431
C  4.287664 1.170793 -0.573032
C  -5.965159 0.657474 -0.03115
C  4.842303 -1.46117 0.276294
C  5.626271 0.738605 -0.480462
C  5.892763 -0.577936 -0.054856
C  -4.635123 -3.200129 1.277975
C  1.613708 2.154319 -0.805476
H  -1.555902 -1.33671 0.496044
H  -2.907104 2.080445 -0.641359
H  -6.299444 -1.362546 0.687878
H  -0.851415 1.528379 -0.504682
H  0.810386 -0.989366 0.284085
H  -5.334341 2.62166 -0.741298
H  2.714713 -1.719378 0.439456
H  4.085864 2.195461 -0.903843
H  -7.034755 0.890135 -0.073646
H  5.059573 -2.481373 0.605094
H  6.443803 1.418373 -0.736082
H  -5.300117 -3.476033 0.437398
H  -5.241287 -2.867075 2.142063
H  -4.021724 -4.066084 1.566128
