program: Gaussian 09
title: 000154228
version: EM64L-G09RevD.01
frameworkgroup: C1[X(C15H27NO5Si)]
method: RPBEPBE
basis: SDD
operation: Freq
keyword: #p
keyword: freq=noraman
keyword: PBEPBE/SDD
title: #p freq=noraman PBEPBE/SDD
converged: YES YES NO NO
title: Mulliken charges:
elementType: Si O O O O O N C C C C C C C C C C C C C C C H H H H H H H H H H H H H H H H H H H H H H H H H H H
charge: 1.508003 -0.562692 -0.560736 -0.530275 -0.270227 -0.269598 -0.257515 -0.431094 -0.433552 0.034170 0.040628 -0.369253 -0.277507 -0.295488 -0.295465 -1.059922 -0.300003 -0.299456 -0.056016 -0.056700 -0.558863 -0.558404 0.231501 0.226045 0.228396 0.225292 0.217822 0.216391 0.236975 0.217386 0.223363 0.188715 0.183644 0.214040 0.182378 0.211616 0.248623 0.249454 0.244639 0.182294 0.207172 0.182378 0.206203 0.230518 0.230666 0.218719 0.218461 0.219084 0.218192
chargesum: 0.00000
title: Mulliken charges with hydrogens summed into heavy atoms:
elementType: Si O O O O O N C C C C C C C C C C C C C C C
charge: 1.508003 -0.562692 -0.560736 -0.530275 -0.270227 -0.269598 -0.257515 0.026452 0.020136 0.251992 0.257019 0.085107 0.134572 0.102197 0.098528 -0.317206 0.089463 0.089125 0.174502 0.173966 -0.121684 -0.121129
polarizability: 2.39396733e+02 2.89775450e+00 1.99142768e+02 4.98811524e-01 -1.66813002e+01 1.85167766e+02
1716.lowfreq: -12.9038 -3.9482 0.0012 0.0015 0.0016 7.9984 14.0416 17.7475 28.4363
frequency: 13.8695 16.6065 28.3262 31.4675 41.0965 45.5031 77.3934 86.0100 97.8539 105.5719 111.2361 126.3977 132.8715 134.4676 161.5241 165.6961 180.4051 206.5107 216.5980 234.9576 236.5284 255.3134 268.4598 278.9958 310.0603 328.9339 356.3539 370.7185 417.6171 428.7127 433.7628 451.3464 458.7340 468.5008 493.2930 550.3057 572.6595 597.2579 608.7824 633.9288 634.3121 663.7258 670.9806 745.2352 801.0721 870.1375 881.0634 884.5429 884.7650 888.7477 899.4385 904.5659 926.3432 928.4803 936.9285 937.8387 950.4808 951.3399 962.8167 975.3686 975.6867 1008.0063 1008.6145 1026.8904 1041.5341 1050.4461 1051.5853 1062.1731 1072.3055 1088.2454 1099.8445 1113.7063 1118.5947 1141.3786 1149.8032 1154.3557 1156.2110 1209.9309 1210.7918 1211.0583 1217.5079 1219.7383 1238.7589 1256.0207 1266.3488 1279.6352 1280.3315 1281.7013 1284.8745 1316.1515 1317.9300 1319.7535 1330.9631 1333.7135 1346.5972 1354.9240 1363.4059 1365.7702 1392.6006 1393.7519 1433.6942 1434.0419 1444.7647 1445.1916 1453.2234 1455.2885 1456.8978 1461.1590 1464.1531 1472.6782 1472.7648 1484.7158 1666.1389 1666.4535 2890.4322 2891.4364 2897.8147 2899.3264 2947.4801 2954.3338 2956.7601 2960.1057 2962.2626 2966.4369 2973.5007 2975.5131 2988.9570 2990.8338 3008.4173 3043.5113 3044.6558 3049.0666 3065.4868 3090.6852 3091.0534 3116.2725 3116.9671 3117.3737 3117.5116 3200.5791 3200.7226
redmass: 4.4346 3.9027 4.3541 2.5435 2.1772 4.0218 3.4891 3.2326 3.1086 4.3248 4.0694 2.9393 1.4521 1.6400 3.6088 3.0850 4.8540 3.2674 2.8766 3.4150 3.4939 3.5540 3.2010 3.0368 3.7742 3.9182 2.8802 2.9209 2.9400 2.7803 2.5968 2.6468 3.8119 3.4712 2.8328 3.4354 2.9929 2.8915 3.1141 1.7402 1.7595 4.9431 4.4335 4.7934 3.3830 2.1436 2.2503 1.4220 1.4571 2.4082 2.4475 2.3473 2.1740 2.1458 2.0455 2.0376 1.3634 1.3622 2.5540 1.6933 1.7399 1.2665 1.2567 3.1219 3.3943 5.4950 4.1688 2.5071 4.8628 3.2603 2.5441 2.5377 2.9087 2.1122 1.7293 1.8069 1.7666 1.1556 1.2130 1.2176 1.1766 1.1403 1.2178 1.3216 1.3432 1.2772 1.2559 1.3180 1.4794 1.2013 1.2032 1.2092 1.2489 1.2938 1.2612 1.3856 1.3453 1.3646 1.4642 1.4499 1.2028 1.2006 1.0487 1.0491 1.1015 1.1070 1.0957 1.0883 1.0876 1.0838 1.0828 1.0805 4.8275 4.8028 1.0626 1.0626 1.0638 1.0637 1.0669 1.0690 1.0706 1.0763 1.0771 1.0688 1.0963 1.0961 1.0960 1.0962 1.0343 1.0972 1.0949 1.0987 1.0980 1.0603 1.0602 1.0987 1.0987 1.0945 1.0945 1.1144 1.1143
irintensity: 0.1376 0.9773 0.5396 2.7680 0.6675 0.1946 0.1431 1.0115 3.2996 3.4511 7.4817 0.4738 3.3928 2.7728 4.8788 8.1487 18.8412 2.0030 6.7639 11.0282 11.9257 7.8538 11.0613 11.9169 2.0816 5.1200 1.7904 0.8209 0.1358 2.2726 2.2988 3.4003 12.7136 2.3418 9.6359 6.6810 29.5237 6.9124 6.8412 17.9577 6.7647 78.0879 91.9426 91.3515 19.5441 35.9448 28.1432 91.5541 66.1992 44.2771 26.2541 29.7593 66.2359 66.0209 6.2460 8.8111 119.5644 109.4255 27.1771 7.0353 11.1795 68.0100 44.9915 168.5252 63.4080 129.4664 64.8134 41.4938 79.2199 67.1337 58.4185 6.4989 33.9039 11.7457 5.0399 0.7676 4.9622 7.0375 1.6572 0.9009 3.5599 6.5355 6.7266 9.5240 10.3490 1.2160 0.3986 3.2105 3.6444 21.3875 42.6799 19.2023 21.0052 26.5640 1.0586 0.8647 0.6161 1.1075 0.5307 0.5474 24.0586 24.9526 7.8434 7.4034 4.4218 4.5706 7.1529 7.0883 10.0037 5.0847 5.4882 5.5060 4.0433 3.9660 26.7240 26.4301 114.3760 117.3922 49.5923 25.3537 24.8697 35.0457 29.1269 125.7788 51.1021 49.6025 45.9068 48.0464 8.6634 18.1988 52.6469 22.1548 38.5279 11.1987 11.1958 13.4047 11.3766 9.7867 9.0160 27.1144 28.2920
temp: 298.150 k
press: 1.00000 atm
elementType: 14 8 8 8 8 8 7 6 6 6 6 6 6 6 6 6 6 6 6 6 6 6 1 1 1 1 1 1 1 1 1 1 1 1 1 1 1 1 1 1 1 1 1 1 1 1 1 1 1
symmnumber: 1
zpe: 1067506.3 jmol-1
zpe.correction: 0.406592 hartree
zpe.thermalcorrener: 0.432069 hartree
zpe.thermalcorrenthalpy: 0.433013 hartree
zpe.thermalcorrgfe: 0.347468 hartree
zpe.sumelectzpe: -1306.277976 hartree
zpe.sumelectthermal: -1306.252499 hartree
zpe.sumelectthermalent: -1306.251555 hartree
zpe.sumelectthermalfe: -1306.337100 hartree
dipole: -1.4647 1.2391 -6.4158
dipole: 6.6965
quadrupole: -129.4140 -129.9589 -139.2904
quadrupole: -7.5520 -2.8914 -7.9419
quadrupole: 3.4738 2.9289 -6.4026 -7.5520 -2.8914 -7.9419
hfenergy: -1306.684568 hartree
pointgroup: C01 [X(C15H27N1O5Si1)]
dipole: -0.5034762 -1.3720323 2.1920853 debye
polarizability: 239.2955785|-2.5130922|208.5322085|-3.2848957|-7.539988|175.8794804 unknown
InChI: InChI=1S/C15H27NO5Si/c1-4-7-17-12-14-10-16-6-9-19-22(3,20-14)21-15(11-16)13-18-8-5-2/h4-5,14-15H,1-2,6-13H2,3H3
charge 0 multiplicity 1
49 atoms
Si -0.02219 -0.478037 -1.628915
O  1.349828 0.204535 -0.762484
O  -1.617479 -0.176539 -0.941705
O  0.209522 -2.069857 -2.352064
O  4.176071 0.67412 0.500241
O  -3.948764 0.862417 0.859666
N  0.037481 -1.886141 0.359793
C  0.999854 -1.169546 1.232793
C  -1.374194 -1.862717 0.815475
C  2.040753 -0.452807 0.330422
C  -1.988682 -0.491195 0.424859
C  0.51618 -3.183656 -0.185795
C  -0.006024 -3.310253 -1.636775
C  2.849838 0.581641 1.115579
C  -3.513309 -0.50093 0.548035
C  -0.066961 0.613481 -3.160053
C  4.954414 1.808781 1.027484
C  -5.412725 1.007541 0.77637
C  6.354801 1.706929 0.481433
C  -5.776185 2.380235 1.279457
C  7.026598 2.729713 -0.10096
C  -6.595443 3.24119 0.628207
H  0.440815 -0.41079 1.811029
H  1.501677 -1.850923 1.951675
H  -1.919264 -2.666562 0.28668
H  -1.465836 -2.043137 1.907373
H  2.757661 -1.193507 -0.084114
H  -1.602135 0.301454 1.100994
H  1.619581 -3.156804 -0.202377
H  0.198588 -4.046391 0.437205
H  0.536688 -4.109572 -2.172435
H  -1.087271 -3.566918 -1.640966
H  2.956116 0.276717 2.184122
H  2.315843 1.55411 1.070075
H  -3.842282 -1.191703 1.361048
H  -3.941705 -0.849533 -0.41546
H  -0.06322 1.677604 -2.870783
H  0.814139 0.418773 -3.793958
H  -0.977053 0.413099 -3.749772
H  4.973051 1.753399 2.142584
H  4.479676 2.770676 0.738395
H  -5.893963 0.226014 1.412415
H  -5.75692 0.859958 -0.269721
H  6.830088 0.723279 0.599307
H  -5.338824 2.651882 2.250076
H  8.056884 2.611019 -0.453699
H  6.565006 3.71422 -0.247156
H  -6.855037 4.217271 1.052267
H  -7.026688 2.997266 -0.350768
