program: Gaussian 09
title: 000154211
version: EM64L-G09RevD.01
frameworkgroup: C1[X(C18H27NO2)]
method: RPBEPBE
basis: SDD
operation: Freq
keyword: #p
keyword: freq=noraman
keyword: PBEPBE/SDD
title: #p freq=noraman PBEPBE/SDD
converged: YES YES NO NO
title: Mulliken charges:
elementType: O O N C C C C C C C C C C C C C C C C C C H H H H H H H H H H H H H H H H H H H H H H H H H H H
charge: -0.329717 -0.453481 -0.347179 0.263722 -0.551724 -0.461802 0.305062 -0.423171 -0.467726 -0.134590 -0.372106 -0.726028 -0.690564 -0.678544 0.171900 -0.314541 0.262543 -0.357329 -0.356755 -0.274103 -0.246507 0.226146 0.217465 0.215000 0.223182 0.234585 0.216378 0.244909 0.216270 0.219125 0.212338 0.252095 0.202257 0.211587 0.230420 0.205684 0.224571 0.210410 0.215756 0.221697 0.204480 0.236045 0.233972 0.246358 0.249698 0.360936 0.225286 0.225990
chargesum: 0.00000
title: Mulliken charges with hydrogens summed into heavy atoms:
elementType: O O N C C C C C C C C C C C C C C C C C C
charge: -0.329717 -0.092545 -0.102270 0.263722 -0.108114 -0.023620 0.305062 0.027793 -0.032331 0.077748 -0.120010 -0.081765 -0.049899 -0.036612 0.171900 0.155475 0.262543 -0.110971 -0.107056 -0.048817 -0.020516
polarizability: 2.32748050e+02 9.03083941e+00 2.50835718e+02 -2.12516695e+01 -3.38852326e+00 1.58880445e+02
1716.lowfreq: -9.9442 -5.0336 -0.0006 -0.0003 0.0002 4.0772 11.5852 17.2371 23.5184
frequency: 10.7553 17.1645 23.4522 39.1176 63.9599 74.1401 95.9123 99.4746 131.8648 159.7400 165.8871 168.8654 190.0129 215.4032 231.8053 243.1576 252.2753 257.3016 284.9465 298.0688 312.7281 334.1034 343.1724 371.3500 404.9061 423.9666 438.5762 451.5914 468.2711 489.4720 494.3410 506.8457 549.9718 563.4604 616.9930 631.4738 651.2222 669.2796 733.5125 737.3085 753.7911 795.0029 813.1416 820.3898 843.6636 849.7082 856.5807 881.2636 897.7829 901.6292 914.8619 918.5767 923.0247 933.1792 939.4143 946.1737 965.7910 972.8176 982.9253 995.1500 1016.6924 1026.5195 1045.2192 1053.6573 1059.9421 1075.7403 1100.2297 1112.0998 1120.7359 1127.7191 1174.5644 1175.8111 1180.6283 1205.9777 1209.0860 1212.7154 1221.0524 1237.9119 1241.7639 1245.8711 1265.8997 1273.9443 1284.2093 1295.4690 1299.0584 1323.0167 1326.9293 1342.9685 1355.2908 1368.4006 1372.3739 1375.8038 1382.2917 1395.6719 1429.0620 1447.1916 1453.3760 1455.6450 1460.4874 1461.0046 1464.1969 1464.7157 1472.1143 1478.7756 1483.1620 1486.9250 1490.4974 1493.1406 1578.4360 1602.0771 1621.1740 2939.5764 2953.7714 2959.4327 2967.3871 2971.7830 2982.7237 2984.2698 3001.9316 3020.4674 3028.0953 3028.7723 3059.8010 3061.8263 3062.0128 3067.5253 3070.0038 3073.0981 3077.6808 3084.5994 3091.6566 3131.4583 3146.6534 3162.3775 3173.4175 3196.2682 3422.7259 3507.8176
redmass: 3.9457 4.2327 2.7927 3.2976 3.9229 3.9088 3.4911 3.2647 4.1251 2.2397 1.3691 2.8527 2.5281 3.1530 2.0525 1.3261 2.1536 1.0723 3.5036 3.4505 3.8358 2.4563 4.6051 2.4485 2.3336 2.6655 2.2585 1.1494 2.6027 3.2575 2.9307 3.5662 4.2282 2.8824 3.6074 2.5654 1.8425 3.4352 3.3358 3.2724 1.2847 3.9193 2.1752 1.9733 2.6547 1.5455 1.9228 2.0987 1.5868 1.7925 2.7271 2.2915 1.6218 1.5192 1.2240 3.0626 2.2507 1.3476 2.9799 1.8210 1.4011 1.5134 1.6937 2.0657 2.0236 2.0561 3.5134 1.8683 1.8264 1.2007 1.2534 1.1249 1.4272 1.9632 1.4473 2.3924 1.6972 2.6788 1.3735 1.3762 1.7176 2.1712 1.6985 1.6383 1.5389 1.4837 1.5031 1.3292 1.4004 1.2139 1.3283 1.2942 5.6673 1.2086 2.1564 1.1331 1.0945 1.1434 1.0887 1.0575 1.0710 1.0746 1.0676 1.1262 1.0798 1.1158 1.9925 1.0912 6.4879 6.1991 7.0455 1.0689 1.0663 1.0642 1.0352 1.0365 1.0358 1.0555 1.0701 1.0929 1.0894 1.0849 1.1037 1.0978 1.0980 1.0988 1.0988 1.1043 1.0981 1.1003 1.0996 1.0850 1.0900 1.0939 1.0985 1.0940 1.0739 1.0653
irintensity: 0.1155 0.0950 0.1237 0.0339 0.3477 0.2048 1.1294 1.1298 1.1969 0.6314 3.6756 2.9739 2.0510 1.2825 3.0436 1.3486 1.7817 0.0696 0.2872 3.5635 1.6168 1.2143 0.9201 4.0370 1.5514 11.7969 5.4414 102.5476 2.3753 7.8839 5.5156 6.7803 7.8948 2.1345 4.7060 17.3766 33.2573 28.8232 2.9659 1.6925 102.2231 6.5224 4.8062 4.0480 17.5732 1.1626 0.8716 3.8930 2.5295 3.9029 8.3049 20.6691 6.3573 8.0397 0.0322 43.4517 2.9064 0.3321 6.7538 19.8387 2.1397 30.8870 1.8551 17.7213 0.0641 27.1996 37.0054 11.5520 47.5419 2.6861 44.6477 10.6849 1.4530 126.1544 36.4294 46.2051 36.1095 39.9654 0.8163 14.1939 13.9264 8.1646 2.8168 3.7820 9.3858 9.2861 3.3907 5.1984 4.3857 25.2115 22.4662 34.8175 4.2457 18.6273 43.5384 18.2734 5.0436 45.3264 4.0662 6.0446 7.4115 1.2108 7.5589 6.6039 13.2499 6.4732 41.7615 17.9855 17.9623 13.6559 6.0060 47.2475 50.3580 36.8012 31.7050 43.8596 10.2869 24.6070 27.8909 33.2578 53.1807 25.5912 14.4961 15.3679 12.7326 43.7744 47.2126 52.7219 67.3599 9.6482 68.3167 0.1919 17.2838 31.1120 14.1203 7.2919 1.8210 36.5700
temp: 298.150 k
press: 1.00000 atm
elementType: 8 8 7 6 6 6 6 6 6 6 6 6 6 6 6 6 6 6 6 6 6 1 1 1 1 1 1 1 1 1 1 1 1 1 1 1 1 1 1 1 1 1 1 1 1 1 1 1
symmnumber: 1
zpe: 1083787.4 jmol-1
zpe.correction: 0.412793 hartree
zpe.thermalcorrener: 0.435213 hartree
zpe.thermalcorrenthalpy: 0.436157 hartree
zpe.thermalcorrgfe: 0.358830 hartree
zpe.sumelectzpe: -905.657033 hartree
zpe.sumelectthermal: -905.634612 hartree
zpe.sumelectthermalent: -905.633668 hartree
zpe.sumelectthermalfe: -905.710995 hartree
dipole: -1.1084 0.7058 -1.6639
dipole: 2.1202
quadrupole: -113.9084 -121.6402 -136.6949
quadrupole: -2.3682 -2.6717 5.5944
quadrupole: 10.1728 2.4410 -12.6138 -2.3682 -2.6717 5.5944
hfenergy: -906.0698254 hartree
pointgroup: C01 [X(C18H27N1O2)]
dipole: -0.3490281 0.0439125 -0.7563318 debye
polarizability: 238.4454941|0.3750249|227.9340487|-26.1911008|-33.4239968|176.0846704 unknown
InChI: InChI=1S/C18H27NO2/c1-18(2,3)19-12-15(20)13-21-17-11-7-6-10-16(17)14-8-4-5-9-14/h6-8,10-11,15,19-20H,4-5,9,12-13H2,1-3H3
charge 0 multiplicity 1
48 atoms
O  0.285098 0.623511 0.487856
O  -1.132942 0.686762 2.851657
N  -3.401491 1.150024 -0.131518
C  -3.90702 0.407773 -1.334135
C  3.157854 -2.74927 0.517677
C  2.539311 -3.796165 1.489805
C  2.071909 -1.668824 0.390684
C  -2.673456 0.400835 0.91657
C  0.998956 -3.574764 1.394824
C  -1.679768 1.336765 1.652728
C  0.885123 -2.149678 0.88344
C  -4.74885 1.421189 -2.147545
C  -4.792717 -0.815562 -0.949832
C  -2.70395 -0.0593 -2.191967
C  2.363998 -0.371938 -0.252494
C  -0.551698 1.82122 0.73364
C  1.493599 0.770116 -0.212036
C  3.593927 -0.206986 -0.95324
C  1.846399 1.985428 -0.844266
C  3.951954 0.998938 -1.590074
C  3.072081 2.100524 -1.535977
H  4.115906 -2.34708 0.897663
H  3.369539 -3.198887 -0.475225
H  2.839249 -4.83067 1.24752
H  2.875374 -3.583309 2.521285
H  -3.329299 -0.059745 1.687481
H  -2.10082 -0.416493 0.444316
H  -4.156147 1.720093 0.27696
H  0.528071 -4.281211 0.67775
H  0.485613 -3.726511 2.363512
H  -2.227116 2.221496 2.028397
H  -0.062369 -1.609513 0.849987
H  -5.621548 1.773291 -1.562776
H  -5.130031 0.957696 -3.074724
H  -4.135853 2.2993 -2.418264
H  -5.676479 -0.492402 -0.367198
H  -4.22473 -1.540809 -0.338552
H  -5.151874 -1.343908 -1.852738
H  -2.067871 -0.786451 -1.65564
H  -2.074891 0.805519 -2.467776
H  -3.060323 -0.547524 -3.117307
H  -0.980927 2.198646 -0.213338
H  0.061277 2.596798 1.231666
H  4.282819 -1.055802 -1.003048
H  1.168843 2.842742 -0.806351
H  -0.382898 0.105648 2.55345
H  4.906128 1.076626 -2.12146
H  3.330939 3.045962 -2.024987
