program: Gaussian 09
title: 000154209
version: EM64L-G09RevD.01
frameworkgroup: C1[X(C16H16O)]
method: RPBEPBE
basis: SDD
operation: Freq
keyword: #pfreq=noraman
keyword: PBEPBE/SDD
title: #p freq=noraman PBEPBE/SDD
converged: YES YES NO NO
title: Mulliken charges:
elementType: O C C C C C C C C C C C C C C C C H H H H H H H H H H H H H H H H
charge: -0.301947 -0.000657 -0.363079 -0.608941 0.486797 -0.395664 -0.406694 0.503509 -0.708481 -0.458739 -0.377005 0.500623 -0.450500 -0.377027 -0.221020 -0.224356 -0.249068 0.243118 0.212640 0.219989 0.229199 0.212902 0.232898 0.228378 0.225334 0.225680 0.231612 0.241603 0.231596 0.239541 0.225181 0.224516 0.228061
chargesum: 0.00000
title: Mulliken charges with hydrogens summed into heavy atoms:
elementType: O C C C C C C C C C C C C C C C C
charge: -0.301947 0.242460 0.069549 -0.166841 0.486797 -0.162766 -0.178316 0.503509 -0.257466 -0.227127 -0.135401 0.500623 -0.218903 -0.137485 0.004161 0.000161 -0.021007
polarizability: 2.22102302e+02 7.97895188e+00 1.53121356e+02 1.68919016e+01 6.39094868e+00 1.29207583e+02
1716.lowfreq: -2.6502 -0.0006 -0.0005 0.0005 3.8886 8.6820 21.4846 26.3953 32.3873
frequency: 19.1413 26.0582 32.3788 40.2017 64.9759 86.9841 164.1604 196.0800 241.8450 292.9283 308.0197 339.9987 370.5578 402.8836 404.1844 408.1778 456.6155 498.9121 549.0181 612.2444 617.3993 638.6755 703.9165 709.7360 724.5916 747.5662 779.4805 799.0084 802.6315 828.1123 850.0325 852.8005 855.3690 877.5056 908.4536 933.6451 951.3389 966.7818 975.6720 977.0987 990.6775 995.2544 1014.1004 1018.6152 1026.6191 1045.1981 1081.2656 1105.3525 1117.7874 1129.0764 1171.1527 1186.5464 1187.5772 1192.2343 1194.8565 1196.4065 1214.3877 1222.6002 1242.2720 1288.2063 1301.3178 1321.8206 1335.6604 1378.4183 1382.8328 1390.6719 1411.8107 1440.1842 1462.1326 1464.9642 1484.0265 1485.7094 1506.4803 1582.2446 1593.9073 1613.9163 1623.6828 2971.8858 2999.0184 3018.4724 3056.2444 3061.2294 3087.9954 3109.7485 3113.7782 3114.8584 3119.2601 3132.5409 3132.9299 3141.3236 3143.5398 3161.9223 3167.0281
redmass: 3.7873 3.7585 4.0042 3.9956 4.2234 4.7636 4.8977 4.3428 4.4989 3.3699 3.3623 4.1298 2.5427 2.5230 2.6268 2.5466 3.3660 2.9174 5.0540 3.7983 6.2493 6.5283 2.0483 3.7586 3.4004 2.0916 3.7253 2.7541 3.3306 3.4911 2.0646 1.3016 1.2486 1.2475 1.5091 1.8572 1.8582 1.4945 1.3881 1.3910 6.1321 1.3213 2.9678 1.2370 2.2110 1.7096 1.5881 1.3011 1.3347 1.3407 1.0587 1.1595 1.1412 1.1677 1.4417 2.6954 2.3443 2.1931 1.4993 1.5984 1.4876 1.2812 1.3589 4.6862 7.0131 2.1856 2.5638 2.1156 1.1442 1.1053 2.2167 1.2022 2.5975 6.6001 6.0815 6.1390 6.4255 1.0597 1.0604 1.1003 1.0984 1.0545 1.0926 1.0870 1.0871 1.0874 1.0863 1.0961 1.0913 1.0969 1.0960 1.1015 1.1186
irintensity: 0.0962 0.4305 0.6117 0.1409 4.0876 1.5887 3.2561 0.5992 1.6289 5.5035 6.4196 2.1565 0.9942 0.7891 0.3748 0.6147 10.1140 22.2946 1.0209 9.7567 0.3608 0.8058 33.1925 3.5956 53.9794 39.8218 44.3281 18.3521 14.5615 5.2621 15.9144 1.5679 0.2731 0.5496 5.7922 7.4069 4.1541 0.9638 0.0365 0.0843 0.3171 0.4247 6.2761 0.5083 8.5153 6.3068 11.7337 6.5806 5.7706 13.7439 0.2440 2.2102 0.8599 2.6333 8.7500 0.4230 0.4919 0.9995 5.6256 1.1531 1.2722 1.2072 0.5263 3.6180 0.0846 15.7440 6.5496 6.6008 16.4844 12.5788 19.5856 8.4166 32.1571 0.5607 1.0591 11.2612 0.3640 29.6621 27.2564 12.5261 3.1307 29.4912 20.2666 11.6448 9.4451 18.6748 2.6384 31.8581 15.8818 2.2440 44.7910 25.0156 32.6382
temp: 298.150 k
press: 1.00000 atm
elementType: 8 6 6 6 6 6 6 6 6 6 6 6 6 6 6 6 6 1 1 1 1 1 1 1 1 1 1 1 1 1 1 1 1
symmnumber: 1
zpe: 711460.6 jmol-1
zpe.correction: 0.270981 hartree
zpe.thermalcorrener: 0.285983 hartree
zpe.thermalcorrenthalpy: 0.286927 hartree
zpe.thermalcorrgfe: 0.225251 hartree
zpe.sumelectzpe: -693.269786 hartree
zpe.sumelectthermal: -693.254785 hartree
zpe.sumelectthermalent: -693.253841 hartree
zpe.sumelectthermalfe: -693.315516 hartree
dipole: 2.6018 -0.1755 -0.0345
dipole: 2.6079
quadrupole: -119.4288 -94.0916 -95.6257
quadrupole: 4.0084 3.5033 1.4973
quadrupole: -16.3801 8.9571 7.4230 4.0084 3.5033 1.4973
hfenergy: -693.5407675 hartree
pointgroup: C01 [X(C16H16O1)]
dipole: -1.0205539 -0.0631457 -0.0849458 debye
polarizability: 218.4843097|-10.1378826|154.4656996|23.7213615|-4.2749664|131.4812317 unknown
InChI: InChI=1S/C16H16O/c1-2-4-13(5-3-1)10-14-6-8-15(9-7-14)11-16-12-17-16/h1-9,16H,10-12H2
charge 0 multiplicity 1
33 atoms
O  5.617563 1.2347 0.751258
C  4.242536 0.612111 0.856131
C  4.375151 2.058375 0.494877
C  3.90698 -0.453492 -0.182767
C  2.415244 -0.766815 -0.200563
C  1.857606 -1.69752 0.711082
C  1.538582 -0.105364 -1.099165
C  -0.404158 -1.304972 -0.180457
C  -1.898044 -1.626836 -0.201442
C  0.469644 -1.962298 0.720064
C  0.153146 -0.368688 -1.089624
C  -2.823693 -0.410571 -0.189916
C  -3.872034 -0.289216 -1.135785
C  -2.674235 0.606069 0.789527
C  -4.755174 0.815386 -1.104301
C  -3.554165 1.709273 0.826122
C  -4.600096 1.818475 -0.12122
H  3.957216 0.368916 1.889615
H  4.235399 2.361637 -0.551171
H  4.168807 2.830869 1.245866
H  4.48983 -1.363899 0.054005
H  4.2480 -0.098412 -1.172396
H  2.515499 -2.227151 1.411836
H  1.94866 0.616852 -1.816245
H  -2.130403 -2.270706 0.67023
H  -2.12698 -2.234643 -1.099629
H  0.06132 -2.691441 1.431247
H  -0.507522 0.157916 -1.788655
H  -3.999038 -1.065392 -1.901256
H  -1.860198 0.531789 1.52086
H  -5.559699 0.89205 -1.844676
H  -3.426107 2.484046 1.590887
H  -5.282735 2.675252 -0.093942
