program: Gaussian 09
title: 000154198
version: EM64L-G09RevD.01
frameworkgroup: C1[X(C12H16N4O3)]
method: RPBEPBE
basis: SDD
operation: Freq
keyword: #p
keyword: freq=noraman
keyword: PBEPBE/SDD
title: #p freq=noraman PBEPBE/SDD
converged: NO YES NO NO
title: Mulliken charges:
elementType: O O O N N N N C C C C C C C C C C C C H H H H H H H H H H H H H H H H
charge: -0.433900 -0.260040 -0.223207 -0.057814 0.059514 -0.008166 0.015230 -0.458175 -0.241182 -0.364015 -0.329984 0.605841 -0.343966 -0.607631 -0.269025 -0.687600 0.213352 -0.284396 -0.009015 0.268754 0.213808 0.201415 0.243408 0.207769 0.183543 0.213748 0.205438 0.194901 0.250985 0.249898 0.225069 0.214897 0.208755 0.341113 0.260678
chargesum: 0.00000
title: Mulliken charges with hydrogens summed into heavy atoms:
elementType: O O O N N N N C C C C C C C C C C C C
charge: -0.092787 -0.260040 -0.223207 -0.057814 0.059514 -0.008166 0.015230 0.024387 -0.039767 0.087162 0.067307 0.605841 0.056373 -0.356646 -0.019127 -0.038879 0.213352 -0.023718 -0.009015
polarizability: 1.99887329e+02 -1.13107080e+01 2.13526169e+02 2.72024133e+01 -3.62692503e+00 1.28181057e+02
1716.lowfreq: -12.5862 -6.0426 -0.0006 -0.0004 0.0004 0.6045 8.2504 20.8069 31.7828
frequency: 6.4420 20.7019 31.4730 50.1922 66.2191 74.8712 81.6408 96.5325 110.3282 122.2574 141.9322 168.8447 215.4343 226.1440 240.0797 261.3556 284.4709 301.2134 323.6110 364.3819 375.3722 390.4122 391.6314 426.9330 433.7545 452.0954 487.5560 513.1577 550.2812 604.3712 613.4587 668.0378 698.1655 736.6793 741.6508 743.0260 784.8928 829.6544 848.5038 867.1651 886.8578 902.2643 905.5643 924.3842 964.5641 976.5687 983.4507 1022.3006 1049.9403 1069.1520 1107.6081 1113.1155 1119.6830 1153.6842 1176.1665 1195.4349 1213.7583 1237.6058 1248.7727 1265.2616 1284.4531 1286.5510 1294.8637 1305.5232 1324.3602 1338.1614 1345.0984 1350.5097 1363.7573 1373.2296 1395.7210 1408.3157 1432.0109 1438.5480 1453.9818 1468.2058 1476.5874 1478.3482 1487.5191 1537.4881 1547.0336 1640.1966 2012.4836 2967.2163 2968.0552 2971.7103 2976.9156 2978.7665 2979.1419 3012.8429 3038.4323 3051.9904 3064.3733 3073.6671 3079.6573 3140.2042 3152.1478 3175.0914 3538.6845
redmass: 5.2911 6.2593 2.5506 8.0279 2.0271 7.8631 6.6169 6.4315 2.3077 5.3433 5.4789 5.5460 4.8661 1.1487 4.3050 1.3031 2.9494 4.8920 4.2053 4.4494 2.9870 4.8305 7.4380 4.2290 3.9380 7.4690 3.9507 5.8024 4.7666 3.7449 5.0741 4.6603 5.5049 1.1849 3.0556 3.6734 1.2172 1.7509 5.1824 1.6460 4.2453 1.7599 2.2726 1.6284 4.3048 1.4967 2.3106 3.6190 2.6833 2.5022 2.6845 2.3422 2.1108 1.6654 1.5086 2.0454 1.3363 1.6146 2.0200 1.3597 1.4061 1.2349 1.1690 1.6900 1.8508 1.6875 1.3527 1.5389 1.8871 1.9377 1.2158 2.1196 1.3299 2.0557 1.0814 1.0725 1.0637 1.0422 1.0845 7.4411 8.3709 6.6769 13.8541 1.0638 1.0640 1.0752 1.0398 1.0612 1.0606 1.0980 1.0996 1.1019 1.0998 1.1010 1.0993 1.0927 1.0871 1.0975 1.0660
irintensity: 0.6031 0.4721 1.3893 0.9440 0.6159 1.5461 0.1066 6.9170 0.4481 1.6248 0.4098 1.7213 1.7012 0.2855 10.6641 124.1018 25.7518 1.0652 0.9786 0.2925 1.9200 0.2017 3.9542 8.4417 6.1958 6.8879 7.1646 7.2527 5.6226 6.9244 14.6129 14.7594 16.2439 6.2467 4.2574 7.7965 3.0436 52.2195 8.9618 35.5977 21.5026 15.8981 76.1228 14.2079 61.2214 8.9857 39.7064 22.4090 5.1489 2.0276 15.2924 14.6386 61.5707 18.1621 35.0013 11.5015 12.4371 10.5642 11.4206 3.7251 0.0961 2.3039 5.8634 9.9009 62.6119 21.7913 6.6243 24.1157 25.8705 16.8413 12.5190 45.9726 13.1641 8.6021 7.1205 2.5613 4.4652 13.9957 20.6292 53.6070 179.4074 121.1670 511.0329 15.4195 11.5181 57.2111 13.8542 52.2378 83.2320 3.2382 17.9114 9.5053 4.2703 85.3581 50.7219 5.8296 2.9987 4.8401 8.4703
temp: 298.150 k
press: 1.00000 atm
elementType: 8 8 8 7 7 7 7 6 6 6 6 6 6 6 6 6 6 6 6 1 1 1 1 1 1 1 1 1 1 1 1 1 1 1 1
symmnumber: 1
zpe: 712214.1 jmol-1
zpe.correction: 0.271268 hartree
zpe.thermalcorrener: 0.291367 hartree
zpe.thermalcorrenthalpy: 0.292311 hartree
zpe.thermalcorrgfe: 0.218686 hartree
zpe.sumelectzpe: -909.995045 hartree
zpe.sumelectthermal: -909.974947 hartree
zpe.sumelectthermalent: -909.974002 hartree
zpe.sumelectthermalfe: -910.047628 hartree
dipole: 8.7892 0.1572 4.1886
dipole: 9.7376
quadrupole: -122.0454 -110.8367 -120.0703
quadrupole: 3.8631 -0.3055 -4.8385
quadrupole: -4.3946 6.8141 -2.4195 3.8631 -0.3055 -4.8385
hfenergy: -910.2663134 hartree
pointgroup: C01 [X(C12H16N4O3)]
dipole: -3.1197961 -0.2798106 2.2057882 debye
polarizability: 189.0342595|-8.6174602|212.1039074|-38.5216695|9.3405935|140.4563872 unknown
InChI: InChI=1S/C12H16N4O3/c1-2-3-6-16(15-19)8-12(18)9-4-5-11(17)10(7-9)14-13/h4-5,7,12,18H,2-3,6,8H2,1H3
charge 0 multiplicity 1
35 atoms
O  0.192172 2.050216 2.503714
O  -0.675299 2.429091 -1.872837
O  4.087377 -0.528196 -1.721912
N  -2.062145 1.31212 -0.477803
N  -1.654218 1.604204 -1.783407
N  2.390398 -2.385543 -0.606014
N  2.891814 -3.381778 -0.986327
C  -1.461748 1.981043 0.688484
C  -0.382152 1.160517 1.469973
C  -3.257355 0.451609 -0.394795
C  -3.028619 -0.92269 0.274155
C  0.778965 0.684427 0.622672
C  -4.305975 -1.79274 0.22049
C  1.006481 -0.667952 0.426225
C  1.67929 1.644676 0.01847
C  -4.115438 -3.167985 0.894954
C  2.119592 -1.093863 -0.375624
C  2.767827 1.263256 -0.744124
C  3.097597 -0.132489 -1.022795
H  -0.981671 2.906697 0.317146
H  -2.278502 2.252813 1.386555
H  -0.868272 0.286353 1.950777
H  -3.590442 0.307511 -1.438416
H  -4.059571 0.996931 0.144262
H  -2.728223 -0.792658 1.333561
H  -2.197718 -1.443368 -0.240817
H  -4.605451 -1.936829 -0.836912
H  -5.14098 -1.25199 0.711177
H  0.359148 -1.425849 0.881205
H  1.49153 2.708999 0.191212
H  -5.039954 -3.770672 0.843842
H  -3.310418 -3.74426 0.401935
H  -3.845143 -3.055829 1.961946
H  -0.529955 2.3703 3.104527
H  3.437156 2.00433 -1.191795
